{"text_format":"1","workbook":"xlsx","n_sheets":5,"sheets":["Daten von Zeitmesser","Grunddaten","Pruefung","Pruefungsrangliste","Schlussrangliste"],"not_rendered":{"charts":0,"images":0,"macros":1,"external_links":0,"defined_names":0,"comments":0,"pivot_tables":0},"unopened":[],"bounds":{"document_bytes":16777216,"sheet_cells":100000,"rows_first":2000,"rows_last":500,"rows_between":2000,"halvings":0,"cell_chars":16384,"cell_head_chars":4096},"cells_cut":0,"cells_raw":0,"read":"whole","date_system":"1900"}

{"sheet":"Daten von Zeitmesser","index":0,"n_rows":1,"n_cols":4,"rows_kept":1,"cut":false,"hidden":false,"merged":[]}
["Startnummer","Reiter","Pferd","Verein"]

{"sheet":"Grunddaten","index":1,"n_rows":91,"n_cols":4,"rows_kept":91,"cut":false,"hidden":false,"merged":[[1,1,1,3],[3,1,3,3],[5,1,5,3],[7,1,7,3]]}
[]
["Veranstaltung","Pferdesporttage"]
[]
["Prüfungsart","OKV Vereins-Cup"]
[]
["Prüfungssponsor","Preis der…"]
[]
["Dokument von","Dieses Dokument wurde erstellt von David Stadelmann - 076 561 41 21"]
[]
[]
["Startnummer","Reiter","Pferd","Verein"]
[{"$f":"IF(ROW('Daten von Zeitmesser'!1:1)>COUNTIF('Daten von Zeitmesser'!$A:$A,101),\"\",INDEX('Daten von Zeitmesser'!A:A,SMALL(IF('Daten von Zeitmesser'!$A$2:$A$100=101,ROW('Daten von Zeitmesser'!$2:$100)),ROW(A1))))","v":""},{"$f":"IF(ROW('Daten von Zeitmesser'!1:1)>COUNTIF('Daten von Zeitmesser'!$A:$A,101),0,INDEX('Daten von Zeitmesser'!B:B,SMALL(IF('Daten von Zeitmesser'!$A$2:$A$100=101,ROW('Daten von Zeitmesser'!$2:$100)),ROW(B1))))","v":0},{"$f":"IF(ROW('Daten von Zeitmesser'!1:1)>COUNTIF('Daten von Zeitmesser'!$A:$A,101),0,INDEX('Daten von Zeitmesser'!C:C,SMALL(IF('Daten von Zeitmesser'!$A$2:$A$100=101,ROW('Daten von Zeitmesser'!$2:$100)),ROW(C1))))","v":0},{"$f":"IF(ROW('Daten von Zeitmesser'!1:1)>COUNTIF('Daten von Zeitmesser'!$A:$A,101),\"100\",INDEX('Daten von Zeitmesser'!D:D,SMALL(IF('Daten von Zeitmesser'!$A$2:$A$100=101,ROW('Daten von Zeitmesser'!$2:$100)),ROW(D1))))","v":"100"}]
[{"$f":"IF(ROW('Daten von Zeitmesser'!$1:$1)>COUNTIF('Daten von Zeitmesser'!$A:$A,201),\"\",INDEX('Daten von Zeitmesser'!A:A,SMALL(IF('Daten von Zeitmesser'!$A$2:$A$100=201,ROW('Daten von Zeitmesser'!$2:$100)),ROW(A1))))","v":""},{"$f":"IF(ROW('Daten von Zeitmesser'!1:1)>COUNTIF('Daten von Zeitmesser'!$A:$A,201),0,INDEX('Daten von Zeitmesser'!B:B,SMALL(IF('Daten von Zeitmesser'!$A$2:$A$100=201,ROW('Daten von Zeitmesser'!$2:$100)),ROW(B1))))","v":0},{"$f":"IF(ROW('Daten von Zeitmesser'!1:1)>COUNTIF('Daten von Zeitmesser'!$A:$A,201),0,INDEX('Daten von Zeitmesser'!C:C,SMALL(IF('Daten von Zeitmesser'!$A$2:$A$100=201,ROW('Daten von Zeitmesser'!$2:$100)),ROW(C1))))","v":0},{"$f":"IF(ROW('Daten von Zeitmesser'!1:1)>COUNTIF('Daten von Zeitmesser'!$A:$A,201),\"101\",INDEX('Daten von Zeitmesser'!D:D,SMALL(IF('Daten von Zeitmesser'!$A$2:$A$100=201,ROW('Daten von Zeitmesser'!$2:$100)),ROW(D1))))","v":"101"}]
[{"$f":"IF(ROW('Daten von Zeitmesser'!$1:$1)>COUNTIF('Daten von Zeitmesser'!$A:$A,301),\"\",INDEX('Daten von Zeitmesser'!A:A,SMALL(IF('Daten von Zeitmesser'!$A$2:$A$100=301,ROW('Daten von Zeitmesser'!$2:$100)),ROW($A$1))))","v":""},{"$f":"IF(ROW('Daten von Zeitmesser'!$1:$1)>COUNTIF('Daten von Zeitmesser'!$A:$A,301),0,INDEX('Daten von Zeitmesser'!B:B,SMALL(IF('Daten von Zeitmesser'!$A$2:$A$100=301,ROW('Daten von Zeitmesser'!$2:$100)),ROW(B1))))","v":0},{"$f":"IF(ROW('Daten von Zeitmesser'!$1:$1)>COUNTIF('Daten von Zeitmesser'!$A:$A,301),0,INDEX('Daten von Zeitmesser'!C:C,SMALL(IF('Daten von Zeitmesser'!$A$2:$A$100=301,ROW('Daten von Zeitmesser'!$2:$100)),ROW(C1))))","v":0},{"$f":"IF(ROW('Daten von Zeitmesser'!$1:$1)>COUNTIF('Daten von Zeitmesser'!$A:$A,301),\"102\",INDEX('Daten von Zeitmesser'!D:D,SMALL(IF('Daten von Zeitmesser'!$A$2:$A$100=301,ROW('Daten von Zeitmesser'!$2:$100)),ROW(D1))))","v":"102"}]
[{"$f":"IF(ROW('Daten von Zeitmesser'!$1:$1)>COUNTIF('Daten von Zeitmesser'!$A:$A,401),\"\",INDEX('Daten von Zeitmesser'!A:A,SMALL(IF('Daten von Zeitmesser'!$A$2:$A$100=401,ROW('Daten von Zeitmesser'!$2:$100)),ROW($A$1))))","v":""},{"$f":"IF(ROW('Daten von Zeitmesser'!$1:$1)>COUNTIF('Daten von Zeitmesser'!$A:$A,401),0,INDEX('Daten von Zeitmesser'!B:B,SMALL(IF('Daten von Zeitmesser'!$A$2:$A$100=401,ROW('Daten von Zeitmesser'!$2:$100)),ROW($A$1))))","v":0},{"$f":"IF(ROW('Daten von Zeitmesser'!$1:$1)>COUNTIF('Daten von Zeitmesser'!$A:$A,401),0,INDEX('Daten von Zeitmesser'!C:C,SMALL(IF('Daten von Zeitmesser'!$A$2:$A$100=401,ROW('Daten von Zeitmesser'!$2:$100)),ROW($A$1))))","v":0},{"$f":"IF(ROW('Daten von Zeitmesser'!$1:$1)>COUNTIF('Daten von Zeitmesser'!$A:$A,401),\"103\",INDEX('Daten von Zeitmesser'!D:D,SMALL(IF('Daten von Zeitmesser'!$A$2:$A$100=401,ROW('Daten von Zeitmesser'!$2:$100)),ROW($A$1))))","v":"103"}]
[{"$f":"IF(ROW('Daten von Zeitmesser'!$1:$1)>COUNTIF('Daten von Zeitmesser'!$A:$A,102),\"\",INDEX('Daten von Zeitmesser'!A:A,SMALL(IF('Daten von Zeitmesser'!$A$2:$A$100=102,ROW('Daten von Zeitmesser'!$2:$100)),ROW($A$1))))","v":""},{"$f":"IF(ROW('Daten von Zeitmesser'!$1:$1)>COUNTIF('Daten von Zeitmesser'!$A:$A,102),0,INDEX('Daten von Zeitmesser'!B:B,SMALL(IF('Daten von Zeitmesser'!$A$2:$A$100=102,ROW('Daten von Zeitmesser'!$2:$100)),ROW($A$1))))","v":0},{"$f":"IF(ROW('Daten von Zeitmesser'!$1:$1)>COUNTIF('Daten von Zeitmesser'!$A:$A,102),0,INDEX('Daten von Zeitmesser'!C:C,SMALL(IF('Daten von Zeitmesser'!$A$2:$A$100=102,ROW('Daten von Zeitmesser'!$2:$100)),ROW($A$1))))","v":0},{"$f":"IF(ROW('Daten von Zeitmesser'!$1:$1)>COUNTIF('Daten von Zeitmesser'!$A:$A,102),\"104\",INDEX('Daten von Zeitmesser'!D:D,SMALL(IF('Daten von Zeitmesser'!$A$2:$A$100=102,ROW('Daten von Zeitmesser'!$2:$100)),ROW($A$1))))","v":"104"}]
[{"$f":"IF(ROW('Daten von Zeitmesser'!$1:$1)>COUNTIF('Daten von Zeitmesser'!$A:$A,202),\"\",INDEX('Daten von Zeitmesser'!A:A,SMALL(IF('Daten von Zeitmesser'!$A$2:$A$100=202,ROW('Daten von Zeitmesser'!$2:$100)),ROW($A$1))))","v":""},{"$f":"IF(ROW('Daten von Zeitmesser'!$1:$1)>COUNTIF('Daten von Zeitmesser'!$A:$A,202),0,INDEX('Daten von Zeitmesser'!B:B,SMALL(IF('Daten von Zeitmesser'!$A$2:$A$100=202,ROW('Daten von Zeitmesser'!$2:$100)),ROW($A$1))))","v":0},{"$f":"IF(ROW('Daten von Zeitmesser'!$1:$1)>COUNTIF('Daten von Zeitmesser'!$A:$A,202),0,INDEX('Daten von Zeitmesser'!C:C,SMALL(IF('Daten von Zeitmesser'!$A$2:$A$100=202,ROW('Daten von Zeitmesser'!$2:$100)),ROW($A$1))))","v":0},{"$f":"IF(ROW('Daten von Zeitmesser'!$1:$1)>COUNTIF('Daten von Zeitmesser'!$A:$A,202),\"105\",INDEX('Daten von Zeitmesser'!D:D,SMALL(IF('Daten von Zeitmesser'!$A$2:$A$100=202,ROW('Daten von Zeitmesser'!$2:$100)),ROW($A$1))))","v":"105"}]
[{"$f":"IF(ROW('Daten von Zeitmesser'!$1:$1)>COUNTIF('Daten von Zeitmesser'!$A:$A,302),\"\",INDEX('Daten von Zeitmesser'!A:A,SMALL(IF('Daten von Zeitmesser'!$A$2:$A$100=302,ROW('Daten von Zeitmesser'!$2:$100)),ROW($A$1))))","v":""},{"$f":"IF(ROW('Daten von Zeitmesser'!$1:$1)>COUNTIF('Daten von Zeitmesser'!$A:$A,302),0,INDEX('Daten von Zeitmesser'!B:B,SMALL(IF('Daten von Zeitmesser'!$A$2:$A$100=302,ROW('Daten von Zeitmesser'!$2:$100)),ROW($A$1))))","v":0},{"$f":"IF(ROW('Daten von Zeitmesser'!$1:$1)>COUNTIF('Daten von Zeitmesser'!$A:$A,302),0,INDEX('Daten von Zeitmesser'!C:C,SMALL(IF('Daten von Zeitmesser'!$A$2:$A$100=302,ROW('Daten von Zeitmesser'!$2:$100)),ROW($A$1))))","v":0},{"$f":"IF(ROW('Daten von Zeitmesser'!$1:$1)>COUNTIF('Daten von Zeitmesser'!$A:$A,302),\"106\",INDEX('Daten von Zeitmesser'!D:D,SMALL(IF('Daten von Zeitmesser'!$A$2:$A$100=302,ROW('Daten von Zeitmesser'!$2:$100)),ROW($A$1))))","v":"106"}]
[{"$f":"IF(ROW('Daten von Zeitmesser'!$1:$1)>COUNTIF('Daten von Zeitmesser'!$A:$A,402),\"\",INDEX('Daten von Zeitmesser'!A:A,SMALL(IF('Daten von Zeitmesser'!$A$2:$A$100=402,ROW('Daten von Zeitmesser'!$2:$100)),ROW($A$1))))","v":""},{"$f":"IF(ROW('Daten von Zeitmesser'!$1:$1)>COUNTIF('Daten von Zeitmesser'!$A:$A,402),0,INDEX('Daten von Zeitmesser'!B:B,SMALL(IF('Daten von Zeitmesser'!$A$2:$A$100=402,ROW('Daten von Zeitmesser'!$2:$100)),ROW($A$1))))","v":0},{"$f":"IF(ROW('Daten von Zeitmesser'!$1:$1)>COUNTIF('Daten von Zeitmesser'!$A:$A,402),0,INDEX('Daten von Zeitmesser'!C:C,SMALL(IF('Daten von Zeitmesser'!$A$2:$A$100=402,ROW('Daten von Zeitmesser'!$2:$100)),ROW($A$1))))","v":0},{"$f":"IF(ROW('Daten von Zeitmesser'!$1:$1)>COUNTIF('Daten von Zeitmesser'!$A:$A,402),\"107\",INDEX('Daten von Zeitmesser'!D:D,SMALL(IF('Daten von Zeitmesser'!$A$2:$A$100=402,ROW('Daten von Zeitmesser'!$2:$100)),ROW($A$1))))","v":"107"}]
[{"$f":"IF(ROW('Daten von Zeitmesser'!$1:$1)>COUNTIF('Daten von Zeitmesser'!$A:$A,103),\"\",INDEX('Daten von Zeitmesser'!A:A,SMALL(IF('Daten von Zeitmesser'!$A$2:$A$100=103,ROW('Daten von Zeitmesser'!$2:$100)),ROW($A$1))))","v":""},{"$f":"IF(ROW('Daten von Zeitmesser'!$1:$1)>COUNTIF('Daten von Zeitmesser'!$A:$A,103),0,INDEX('Daten von Zeitmesser'!B:B,SMALL(IF('Daten von Zeitmesser'!$A$2:$A$100=103,ROW('Daten von Zeitmesser'!$2:$100)),ROW($A$1))))","v":0},{"$f":"IF(ROW('Daten von Zeitmesser'!$1:$1)>COUNTIF('Daten von Zeitmesser'!$A:$A,103),0,INDEX('Daten von Zeitmesser'!C:C,SMALL(IF('Daten von Zeitmesser'!$A$2:$A$100=103,ROW('Daten von Zeitmesser'!$2:$100)),ROW($A$1))))","v":0},{"$f":"IF(ROW('Daten von Zeitmesser'!$1:$1)>COUNTIF('Daten von Zeitmesser'!$A:$A,103),\"108\",INDEX('Daten von Zeitmesser'!D:D,SMALL(IF('Daten von Zeitmesser'!$A$2:$A$100=103,ROW('Daten von Zeitmesser'!$2:$100)),ROW($A$1))))","v":"108"}]
[{"$f":"IF(ROW('Daten von Zeitmesser'!$1:$1)>COUNTIF('Daten von Zeitmesser'!$A:$A,203),\"\",INDEX('Daten von Zeitmesser'!A:A,SMALL(IF('Daten von Zeitmesser'!$A$2:$A$100=203,ROW('Daten von Zeitmesser'!$2:$100)),ROW($A$1))))","v":""},{"$f":"IF(ROW('Daten von Zeitmesser'!$1:$1)>COUNTIF('Daten von Zeitmesser'!$A:$A,203),0,INDEX('Daten von Zeitmesser'!B:B,SMALL(IF('Daten von Zeitmesser'!$A$2:$A$100=203,ROW('Daten von Zeitmesser'!$2:$100)),ROW($A$1))))","v":0},{"$f":"IF(ROW('Daten von Zeitmesser'!$1:$1)>COUNTIF('Daten von Zeitmesser'!$A:$A,203),0,INDEX('Daten von Zeitmesser'!C:C,SMALL(IF('Daten von Zeitmesser'!$A$2:$A$100=203,ROW('Daten von Zeitmesser'!$2:$100)),ROW($A$1))))","v":0},{"$f":"IF(ROW('Daten von Zeitmesser'!$1:$1)>COUNTIF('Daten von Zeitmesser'!$A:$A,203),\"109\",INDEX('Daten von Zeitmesser'!D:D,SMALL(IF('Daten von Zeitmesser'!$A$2:$A$100=203,ROW('Daten von Zeitmesser'!$2:$100)),ROW($A$1))))","v":"109"}]
[{"$f":"IF(ROW('Daten von Zeitmesser'!$1:$1)>COUNTIF('Daten von Zeitmesser'!$A:$A,303),\"\",INDEX('Daten von Zeitmesser'!A:A,SMALL(IF('Daten von Zeitmesser'!$A$2:$A$100=303,ROW('Daten von Zeitmesser'!$2:$100)),ROW($A$1))))","v":""},{"$f":"IF(ROW('Daten von Zeitmesser'!$1:$1)>COUNTIF('Daten von Zeitmesser'!$A:$A,303),0,INDEX('Daten von Zeitmesser'!B:B,SMALL(IF('Daten von Zeitmesser'!$A$2:$A$100=303,ROW('Daten von Zeitmesser'!$2:$100)),ROW($A$1))))","v":0},{"$f":"IF(ROW('Daten von Zeitmesser'!$1:$1)>COUNTIF('Daten von Zeitmesser'!$A:$A,303),0,INDEX('Daten von Zeitmesser'!C:C,SMALL(IF('Daten von Zeitmesser'!$A$2:$A$100=303,ROW('Daten von Zeitmesser'!$2:$100)),ROW($A$1))))","v":0},{"$f":"IF(ROW('Daten von Zeitmesser'!$1:$1)>COUNTIF('Daten von Zeitmesser'!$A:$A,303),\"110\",INDEX('Daten von Zeitmesser'!D:D,SMALL(IF('Daten von Zeitmesser'!$A$2:$A$100=303,ROW('Daten von Zeitmesser'!$2:$100)),ROW($A$1))))","v":"110"}]
[{"$f":"IF(ROW('Daten von Zeitmesser'!$1:$1)>COUNTIF('Daten von Zeitmesser'!$A:$A,403),\"\",INDEX('Daten von Zeitmesser'!A:A,SMALL(IF('Daten von Zeitmesser'!$A$2:$A$100=403,ROW('Daten von Zeitmesser'!$2:$100)),ROW($A$1))))","v":""},{"$f":"IF(ROW('Daten von Zeitmesser'!$1:$1)>COUNTIF('Daten von Zeitmesser'!$A:$A,403),0,INDEX('Daten von Zeitmesser'!B:B,SMALL(IF('Daten von Zeitmesser'!$A$2:$A$100=403,ROW('Daten von Zeitmesser'!$2:$100)),ROW($A$1))))","v":0},{"$f":"IF(ROW('Daten von Zeitmesser'!$1:$1)>COUNTIF('Daten von Zeitmesser'!$A:$A,403),0,INDEX('Daten von Zeitmesser'!C:C,SMALL(IF('Daten von Zeitmesser'!$A$2:$A$100=403,ROW('Daten von Zeitmesser'!$2:$100)),ROW($A$1))))","v":0},{"$f":"IF(ROW('Daten von Zeitmesser'!$1:$1)>COUNTIF('Daten von Zeitmesser'!$A:$A,403),\"111\",INDEX('Daten von Zeitmesser'!D:D,SMALL(IF('Daten von Zeitmesser'!$A$2:$A$100=403,ROW('Daten von Zeitmesser'!$2:$100)),ROW($A$1))))","v":"111"}]
[{"$f":"IF(ROW('Daten von Zeitmesser'!$1:$1)>COUNTIF('Daten von Zeitmesser'!$A:$A,104),\"\",INDEX('Daten von Zeitmesser'!A:A,SMALL(IF('Daten von Zeitmesser'!$A$2:$A$100=104,ROW('Daten von Zeitmesser'!$2:$100)),ROW($A$1))))","v":""},{"$f":"IF(ROW('Daten von Zeitmesser'!$1:$1)>COUNTIF('Daten von Zeitmesser'!$A:$A,104),0,INDEX('Daten von Zeitmesser'!B:B,SMALL(IF('Daten von Zeitmesser'!$A$2:$A$100=104,ROW('Daten von Zeitmesser'!$2:$100)),ROW($A$1))))","v":0},{"$f":"IF(ROW('Daten von Zeitmesser'!$1:$1)>COUNTIF('Daten von Zeitmesser'!$A:$A,104),0,INDEX('Daten von Zeitmesser'!C:C,SMALL(IF('Daten von Zeitmesser'!$A$2:$A$100=104,ROW('Daten von Zeitmesser'!$2:$100)),ROW($A$1))))","v":0},{"$f":"IF(ROW('Daten von Zeitmesser'!$1:$1)>COUNTIF('Daten von Zeitmesser'!$A:$A,104),\"112\",INDEX('Daten von Zeitmesser'!D:D,SMALL(IF('Daten von Zeitmesser'!$A$2:$A$100=104,ROW('Daten von Zeitmesser'!$2:$100)),ROW($A$1))))","v":"112"}]
[{"$f":"IF(ROW('Daten von Zeitmesser'!$1:$1)>COUNTIF('Daten von Zeitmesser'!$A:$A,204),\"\",INDEX('Daten von Zeitmesser'!A:A,SMALL(IF('Daten von Zeitmesser'!$A$2:$A$100=204,ROW('Daten von Zeitmesser'!$2:$100)),ROW($A$1))))","v":""},{"$f":"IF(ROW('Daten von Zeitmesser'!$1:$1)>COUNTIF('Daten von Zeitmesser'!$A:$A,204),0,INDEX('Daten von Zeitmesser'!B:B,SMALL(IF('Daten von Zeitmesser'!$A$2:$A$100=204,ROW('Daten von Zeitmesser'!$2:$100)),ROW($A$1))))","v":0},{"$f":"IF(ROW('Daten von Zeitmesser'!$1:$1)>COUNTIF('Daten von Zeitmesser'!$A:$A,204),0,INDEX('Daten von Zeitmesser'!C:C,SMALL(IF('Daten von Zeitmesser'!$A$2:$A$100=204,ROW('Daten von Zeitmesser'!$2:$100)),ROW($A$1))))","v":0},{"$f":"IF(ROW('Daten von Zeitmesser'!$1:$1)>COUNTIF('Daten von Zeitmesser'!$A:$A,204),\"113\",INDEX('Daten von Zeitmesser'!D:D,SMALL(IF('Daten von Zeitmesser'!$A$2:$A$100=204,ROW('Daten von Zeitmesser'!$2:$100)),ROW($A$1))))","v":"113"}]
[{"$f":"IF(ROW('Daten von Zeitmesser'!$1:$1)>COUNTIF('Daten von Zeitmesser'!$A:$A,304),\"\",INDEX('Daten von Zeitmesser'!A:A,SMALL(IF('Daten von Zeitmesser'!$A$2:$A$100=304,ROW('Daten von Zeitmesser'!$2:$100)),ROW($A$1))))","v":""},{"$f":"IF(ROW('Daten von Zeitmesser'!$1:$1)>COUNTIF('Daten von Zeitmesser'!$A:$A,304),0,INDEX('Daten von Zeitmesser'!B:B,SMALL(IF('Daten von Zeitmesser'!$A$2:$A$100=304,ROW('Daten von Zeitmesser'!$2:$100)),ROW($A$1))))","v":0},{"$f":"IF(ROW('Daten von Zeitmesser'!$1:$1)>COUNTIF('Daten von Zeitmesser'!$A:$A,304),0,INDEX('Daten von Zeitmesser'!C:C,SMALL(IF('Daten von Zeitmesser'!$A$2:$A$100=304,ROW('Daten von Zeitmesser'!$2:$100)),ROW($A$1))))","v":0},{"$f":"IF(ROW('Daten von Zeitmesser'!$1:$1)>COUNTIF('Daten von Zeitmesser'!$A:$A,304),\"114\",INDEX('Daten von Zeitmesser'!D:D,SMALL(IF('Daten von Zeitmesser'!$A$2:$A$100=304,ROW('Daten von Zeitmesser'!$2:$100)),ROW($A$1))))","v":"114"}]
[{"$f":"IF(ROW('Daten von Zeitmesser'!$1:$1)>COUNTIF('Daten von Zeitmesser'!$A:$A,404),\"\",INDEX('Daten von Zeitmesser'!A:A,SMALL(IF('Daten von Zeitmesser'!$A$2:$A$100=404,ROW('Daten von Zeitmesser'!$2:$100)),ROW($A$1))))","v":""},{"$f":"IF(ROW('Daten von Zeitmesser'!$1:$1)>COUNTIF('Daten von Zeitmesser'!$A:$A,404),0,INDEX('Daten von Zeitmesser'!B:B,SMALL(IF('Daten von Zeitmesser'!$A$2:$A$100=404,ROW('Daten von Zeitmesser'!$2:$100)),ROW($A$1))))","v":0},{"$f":"IF(ROW('Daten von Zeitmesser'!$1:$1)>COUNTIF('Daten von Zeitmesser'!$A:$A,404),0,INDEX('Daten von Zeitmesser'!C:C,SMALL(IF('Daten von Zeitmesser'!$A$2:$A$100=404,ROW('Daten von Zeitmesser'!$2:$100)),ROW($A$1))))","v":0},{"$f":"IF(ROW('Daten von Zeitmesser'!$1:$1)>COUNTIF('Daten von Zeitmesser'!$A:$A,404),\"115\",INDEX('Daten von Zeitmesser'!D:D,SMALL(IF('Daten von Zeitmesser'!$A$2:$A$100=404,ROW('Daten von Zeitmesser'!$2:$100)),ROW($A$1))))","v":"115"}]
[{"$f":"IF(ROW('Daten von Zeitmesser'!$1:$1)>COUNTIF('Daten von Zeitmesser'!$A:$A,105),\"\",INDEX('Daten von Zeitmesser'!A:A,SMALL(IF('Daten von Zeitmesser'!$A$2:$A$100=105,ROW('Daten von Zeitmesser'!$2:$100)),ROW($A$1))))","v":""},{"$f":"IF(ROW('Daten von Zeitmesser'!$1:$1)>COUNTIF('Daten von Zeitmesser'!$A:$A,105),0,INDEX('Daten von Zeitmesser'!B:B,SMALL(IF('Daten von Zeitmesser'!$A$2:$A$100=105,ROW('Daten von Zeitmesser'!$2:$100)),ROW($A$1))))","v":0},{"$f":"IF(ROW('Daten von Zeitmesser'!$1:$1)>COUNTIF('Daten von Zeitmesser'!$A:$A,105),0,INDEX('Daten von Zeitmesser'!C:C,SMALL(IF('Daten von Zeitmesser'!$A$2:$A$100=105,ROW('Daten von Zeitmesser'!$2:$100)),ROW($A$1))))","v":0},{"$f":"IF(ROW('Daten von Zeitmesser'!$1:$1)>COUNTIF('Daten von Zeitmesser'!$A:$A,105),\"116\",INDEX('Daten von Zeitmesser'!D:D,SMALL(IF('Daten von Zeitmesser'!$A$2:$A$100=105,ROW('Daten von Zeitmesser'!$2:$100)),ROW($A$1))))","v":"116"}]
[{"$f":"IF(ROW('Daten von Zeitmesser'!$1:$1)>COUNTIF('Daten von Zeitmesser'!$A:$A,205),\"\",INDEX('Daten von Zeitmesser'!A:A,SMALL(IF('Daten von Zeitmesser'!$A$2:$A$100=205,ROW('Daten von Zeitmesser'!$2:$100)),ROW($A$1))))","v":""},{"$f":"IF(ROW('Daten von Zeitmesser'!$1:$1)>COUNTIF('Daten von Zeitmesser'!$A:$A,205),0,INDEX('Daten von Zeitmesser'!B:B,SMALL(IF('Daten von Zeitmesser'!$A$2:$A$100=205,ROW('Daten von Zeitmesser'!$2:$100)),ROW($A$1))))","v":0},{"$f":"IF(ROW('Daten von Zeitmesser'!$1:$1)>COUNTIF('Daten von Zeitmesser'!$A:$A,205),0,INDEX('Daten von Zeitmesser'!C:C,SMALL(IF('Daten von Zeitmesser'!$A$2:$A$100=205,ROW('Daten von Zeitmesser'!$2:$100)),ROW($A$1))))","v":0},{"$f":"IF(ROW('Daten von Zeitmesser'!$1:$1)>COUNTIF('Daten von Zeitmesser'!$A:$A,205),\"117\",INDEX('Daten von Zeitmesser'!D:D,SMALL(IF('Daten von Zeitmesser'!$A$2:$A$100=205,ROW('Daten von Zeitmesser'!$2:$100)),ROW($A$1))))","v":"117"}]
[{"$f":"IF(ROW('Daten von Zeitmesser'!$1:$1)>COUNTIF('Daten von Zeitmesser'!$A:$A,305),\"\",INDEX('Daten von Zeitmesser'!A:A,SMALL(IF('Daten von Zeitmesser'!$A$2:$A$100=305,ROW('Daten von Zeitmesser'!$2:$100)),ROW($A$1))))","v":""},{"$f":"IF(ROW('Daten von Zeitmesser'!$1:$1)>COUNTIF('Daten von Zeitmesser'!$A:$A,305),0,INDEX('Daten von Zeitmesser'!B:B,SMALL(IF('Daten von Zeitmesser'!$A$2:$A$100=305,ROW('Daten von Zeitmesser'!$2:$100)),ROW($A$1))))","v":0},{"$f":"IF(ROW('Daten von Zeitmesser'!$1:$1)>COUNTIF('Daten von Zeitmesser'!$A:$A,305),0,INDEX('Daten von Zeitmesser'!C:C,SMALL(IF('Daten von Zeitmesser'!$A$2:$A$100=305,ROW('Daten von Zeitmesser'!$2:$100)),ROW($A$1))))","v":0},{"$f":"IF(ROW('Daten von Zeitmesser'!$1:$1)>COUNTIF('Daten von Zeitmesser'!$A:$A,305),\"118\",INDEX('Daten von Zeitmesser'!D:D,SMALL(IF('Daten von Zeitmesser'!$A$2:$A$100=305,ROW('Daten von Zeitmesser'!$2:$100)),ROW($A$1))))","v":"118"}]
[{"$f":"IF(ROW('Daten von Zeitmesser'!$1:$1)>COUNTIF('Daten von Zeitmesser'!$A:$A,405),\"\",INDEX('Daten von Zeitmesser'!A:A,SMALL(IF('Daten von Zeitmesser'!$A$2:$A$100=405,ROW('Daten von Zeitmesser'!$2:$100)),ROW($A$1))))","v":""},{"$f":"IF(ROW('Daten von Zeitmesser'!$1:$1)>COUNTIF('Daten von Zeitmesser'!$A:$A,405),0,INDEX('Daten von Zeitmesser'!B:B,SMALL(IF('Daten von Zeitmesser'!$A$2:$A$100=405,ROW('Daten von Zeitmesser'!$2:$100)),ROW($A$1))))","v":0},{"$f":"IF(ROW('Daten von Zeitmesser'!$1:$1)>COUNTIF('Daten von Zeitmesser'!$A:$A,405),0,INDEX('Daten von Zeitmesser'!C:C,SMALL(IF('Daten von Zeitmesser'!$A$2:$A$100=405,ROW('Daten von Zeitmesser'!$2:$100)),ROW($A$1))))","v":0},{"$f":"IF(ROW('Daten von Zeitmesser'!$1:$1)>COUNTIF('Daten von Zeitmesser'!$A:$A,405),\"119\",INDEX('Daten von Zeitmesser'!D:D,SMALL(IF('Daten von Zeitmesser'!$A$2:$A$100=405,ROW('Daten von Zeitmesser'!$2:$100)),ROW($A$1))))","v":"119"}]
[{"$f":"IF(ROW('Daten von Zeitmesser'!$1:$1)>COUNTIF('Daten von Zeitmesser'!$A:$A,106),\"\",INDEX('Daten von Zeitmesser'!A:A,SMALL(IF('Daten von Zeitmesser'!$A$2:$A$100=106,ROW('Daten von Zeitmesser'!$2:$100)),ROW($A$1))))","v":""},{"$f":"IF(ROW('Daten von Zeitmesser'!$1:$1)>COUNTIF('Daten von Zeitmesser'!$A:$A,106),0,INDEX('Daten von Zeitmesser'!B:B,SMALL(IF('Daten von Zeitmesser'!$A$2:$A$100=106,ROW('Daten von Zeitmesser'!$2:$100)),ROW($A$1))))","v":0},{"$f":"IF(ROW('Daten von Zeitmesser'!$1:$1)>COUNTIF('Daten von Zeitmesser'!$A:$A,106),0,INDEX('Daten von Zeitmesser'!C:C,SMALL(IF('Daten von Zeitmesser'!$A$2:$A$100=106,ROW('Daten von Zeitmesser'!$2:$100)),ROW($A$1))))","v":0},{"$f":"IF(ROW('Daten von Zeitmesser'!$1:$1)>COUNTIF('Daten von Zeitmesser'!$A:$A,106),\"120\",INDEX('Daten von Zeitmesser'!D:D,SMALL(IF('Daten von Zeitmesser'!$A$2:$A$100=106,ROW('Daten von Zeitmesser'!$2:$100)),ROW($A$1))))","v":"120"}]
[{"$f":"IF(ROW('Daten von Zeitmesser'!$1:$1)>COUNTIF('Daten von Zeitmesser'!$A:$A,206),\"\",INDEX('Daten von Zeitmesser'!A:A,SMALL(IF('Daten von Zeitmesser'!$A$2:$A$100=206,ROW('Daten von Zeitmesser'!$2:$100)),ROW($A$1))))","v":""},{"$f":"IF(ROW('Daten von Zeitmesser'!$1:$1)>COUNTIF('Daten von Zeitmesser'!$A:$A,206),0,INDEX('Daten von Zeitmesser'!B:B,SMALL(IF('Daten von Zeitmesser'!$A$2:$A$100=206,ROW('Daten von Zeitmesser'!$2:$100)),ROW($A$1))))","v":0},{"$f":"IF(ROW('Daten von Zeitmesser'!$1:$1)>COUNTIF('Daten von Zeitmesser'!$A:$A,206),0,INDEX('Daten von Zeitmesser'!C:C,SMALL(IF('Daten von Zeitmesser'!$A$2:$A$100=206,ROW('Daten von Zeitmesser'!$2:$100)),ROW($A$1))))","v":0},{"$f":"IF(ROW('Daten von Zeitmesser'!$1:$1)>COUNTIF('Daten von Zeitmesser'!$A:$A,206),\"121\",INDEX('Daten von Zeitmesser'!D:D,SMALL(IF('Daten von Zeitmesser'!$A$2:$A$100=206,ROW('Daten von Zeitmesser'!$2:$100)),ROW($A$1))))","v":"121"}]
[{"$f":"IF(ROW('Daten von Zeitmesser'!$1:$1)>COUNTIF('Daten von Zeitmesser'!$A:$A,306),\"\",INDEX('Daten von Zeitmesser'!A:A,SMALL(IF('Daten von Zeitmesser'!$A$2:$A$100=306,ROW('Daten von Zeitmesser'!$2:$100)),ROW($A$1))))","v":""},{"$f":"IF(ROW('Daten von Zeitmesser'!$1:$1)>COUNTIF('Daten von Zeitmesser'!$A:$A,306),0,INDEX('Daten von Zeitmesser'!B:B,SMALL(IF('Daten von Zeitmesser'!$A$2:$A$100=306,ROW('Daten von Zeitmesser'!$2:$100)),ROW($A$1))))","v":0},{"$f":"IF(ROW('Daten von Zeitmesser'!$1:$1)>COUNTIF('Daten von Zeitmesser'!$A:$A,306),0,INDEX('Daten von Zeitmesser'!C:C,SMALL(IF('Daten von Zeitmesser'!$A$2:$A$100=306,ROW('Daten von Zeitmesser'!$2:$100)),ROW($A$1))))","v":0},{"$f":"IF(ROW('Daten von Zeitmesser'!$1:$1)>COUNTIF('Daten von Zeitmesser'!$A:$A,306),\"122\",INDEX('Daten von Zeitmesser'!D:D,SMALL(IF('Daten von Zeitmesser'!$A$2:$A$100=306,ROW('Daten von Zeitmesser'!$2:$100)),ROW($A$1))))","v":"122"}]
[{"$f":"IF(ROW('Daten von Zeitmesser'!$1:$1)>COUNTIF('Daten von Zeitmesser'!$A:$A,406),\"\",INDEX('Daten von Zeitmesser'!A:A,SMALL(IF('Daten von Zeitmesser'!$A$2:$A$100=406,ROW('Daten von Zeitmesser'!$2:$100)),ROW($A$1))))","v":""},{"$f":"IF(ROW('Daten von Zeitmesser'!$1:$1)>COUNTIF('Daten von Zeitmesser'!$A:$A,406),0,INDEX('Daten von Zeitmesser'!B:B,SMALL(IF('Daten von Zeitmesser'!$A$2:$A$100=406,ROW('Daten von Zeitmesser'!$2:$100)),ROW($A$1))))","v":0},{"$f":"IF(ROW('Daten von Zeitmesser'!$1:$1)>COUNTIF('Daten von Zeitmesser'!$A:$A,406),0,INDEX('Daten von Zeitmesser'!C:C,SMALL(IF('Daten von Zeitmesser'!$A$2:$A$100=406,ROW('Daten von Zeitmesser'!$2:$100)),ROW($A$1))))","v":0},{"$f":"IF(ROW('Daten von Zeitmesser'!$1:$1)>COUNTIF('Daten von Zeitmesser'!$A:$A,406),\"123\",INDEX('Daten von Zeitmesser'!D:D,SMALL(IF('Daten von Zeitmesser'!$A$2:$A$100=406,ROW('Daten von Zeitmesser'!$2:$100)),ROW($A$1))))","v":"123"}]
[{"$f":"IF(ROW('Daten von Zeitmesser'!$1:$1)>COUNTIF('Daten von Zeitmesser'!$A:$A,107),\"\",INDEX('Daten von Zeitmesser'!A:A,SMALL(IF('Daten von Zeitmesser'!$A$2:$A$100=107,ROW('Daten von Zeitmesser'!$2:$100)),ROW($A$1))))","v":""},{"$f":"IF(ROW('Daten von Zeitmesser'!$1:$1)>COUNTIF('Daten von Zeitmesser'!$A:$A,107),0,INDEX('Daten von Zeitmesser'!B:B,SMALL(IF('Daten von Zeitmesser'!$A$2:$A$100=107,ROW('Daten von Zeitmesser'!$2:$100)),ROW($A$1))))","v":0},{"$f":"IF(ROW('Daten von Zeitmesser'!$1:$1)>COUNTIF('Daten von Zeitmesser'!$A:$A,107),0,INDEX('Daten von Zeitmesser'!C:C,SMALL(IF('Daten von Zeitmesser'!$A$2:$A$100=107,ROW('Daten von Zeitmesser'!$2:$100)),ROW($A$1))))","v":0},{"$f":"IF(ROW('Daten von Zeitmesser'!$1:$1)>COUNTIF('Daten von Zeitmesser'!$A:$A,107),\"124\",INDEX('Daten von Zeitmesser'!D:D,SMALL(IF('Daten von Zeitmesser'!$A$2:$A$100=107,ROW('Daten von Zeitmesser'!$2:$100)),ROW($A$1))))","v":"124"}]
[{"$f":"IF(ROW('Daten von Zeitmesser'!$1:$1)>COUNTIF('Daten von Zeitmesser'!$A:$A,207),\"\",INDEX('Daten von Zeitmesser'!A:A,SMALL(IF('Daten von Zeitmesser'!$A$2:$A$100=207,ROW('Daten von Zeitmesser'!$2:$100)),ROW($A$1))))","v":""},{"$f":"IF(ROW('Daten von Zeitmesser'!$1:$1)>COUNTIF('Daten von Zeitmesser'!$A:$A,207),0,INDEX('Daten von Zeitmesser'!B:B,SMALL(IF('Daten von Zeitmesser'!$A$2:$A$100=207,ROW('Daten von Zeitmesser'!$2:$100)),ROW($A$1))))","v":0},{"$f":"IF(ROW('Daten von Zeitmesser'!$1:$1)>COUNTIF('Daten von Zeitmesser'!$A:$A,207),0,INDEX('Daten von Zeitmesser'!C:C,SMALL(IF('Daten von Zeitmesser'!$A$2:$A$100=207,ROW('Daten von Zeitmesser'!$2:$100)),ROW($A$1))))","v":0},{"$f":"IF(ROW('Daten von Zeitmesser'!$1:$1)>COUNTIF('Daten von Zeitmesser'!$A:$A,207),\"125\",INDEX('Daten von Zeitmesser'!D:D,SMALL(IF('Daten von Zeitmesser'!$A$2:$A$100=207,ROW('Daten von Zeitmesser'!$2:$100)),ROW($A$1))))","v":"125"}]
[{"$f":"IF(ROW('Daten von Zeitmesser'!$1:$1)>COUNTIF('Daten von Zeitmesser'!$A:$A,307),\"\",INDEX('Daten von Zeitmesser'!A:A,SMALL(IF('Daten von Zeitmesser'!$A$2:$A$100=307,ROW('Daten von Zeitmesser'!$2:$100)),ROW($A$1))))","v":""},{"$f":"IF(ROW('Daten von Zeitmesser'!$1:$1)>COUNTIF('Daten von Zeitmesser'!$A:$A,307),0,INDEX('Daten von Zeitmesser'!B:B,SMALL(IF('Daten von Zeitmesser'!$A$2:$A$100=307,ROW('Daten von Zeitmesser'!$2:$100)),ROW($A$1))))","v":0},{"$f":"IF(ROW('Daten von Zeitmesser'!$1:$1)>COUNTIF('Daten von Zeitmesser'!$A:$A,307),0,INDEX('Daten von Zeitmesser'!C:C,SMALL(IF('Daten von Zeitmesser'!$A$2:$A$100=307,ROW('Daten von Zeitmesser'!$2:$100)),ROW($A$1))))","v":0},{"$f":"IF(ROW('Daten von Zeitmesser'!$1:$1)>COUNTIF('Daten von Zeitmesser'!$A:$A,307),\"126\",INDEX('Daten von Zeitmesser'!D:D,SMALL(IF('Daten von Zeitmesser'!$A$2:$A$100=307,ROW('Daten von Zeitmesser'!$2:$100)),ROW($A$1))))","v":"126"}]
[{"$f":"IF(ROW('Daten von Zeitmesser'!$1:$1)>COUNTIF('Daten von Zeitmesser'!$A:$A,407),\"\",INDEX('Daten von Zeitmesser'!A:A,SMALL(IF('Daten von Zeitmesser'!$A$2:$A$100=407,ROW('Daten von Zeitmesser'!$2:$100)),ROW($A$1))))","v":""},{"$f":"IF(ROW('Daten von Zeitmesser'!$1:$1)>COUNTIF('Daten von Zeitmesser'!$A:$A,407),0,INDEX('Daten von Zeitmesser'!B:B,SMALL(IF('Daten von Zeitmesser'!$A$2:$A$100=407,ROW('Daten von Zeitmesser'!$2:$100)),ROW($A$1))))","v":0},{"$f":"IF(ROW('Daten von Zeitmesser'!$1:$1)>COUNTIF('Daten von Zeitmesser'!$A:$A,407),0,INDEX('Daten von Zeitmesser'!C:C,SMALL(IF('Daten von Zeitmesser'!$A$2:$A$100=407,ROW('Daten von Zeitmesser'!$2:$100)),ROW($A$1))))","v":0},{"$f":"IF(ROW('Daten von Zeitmesser'!$1:$1)>COUNTIF('Daten von Zeitmesser'!$A:$A,407),\"127\",INDEX('Daten von Zeitmesser'!D:D,SMALL(IF('Daten von Zeitmesser'!$A$2:$A$100=407,ROW('Daten von Zeitmesser'!$2:$100)),ROW($A$1))))","v":"127"}]
[{"$f":"IF(ROW('Daten von Zeitmesser'!$1:$1)>COUNTIF('Daten von Zeitmesser'!$A:$A,108),\"\",INDEX('Daten von Zeitmesser'!A:A,SMALL(IF('Daten von Zeitmesser'!$A$2:$A$100=108,ROW('Daten von Zeitmesser'!$2:$100)),ROW($A$1))))","v":""},{"$f":"IF(ROW('Daten von Zeitmesser'!$1:$1)>COUNTIF('Daten von Zeitmesser'!$A:$A,108),0,INDEX('Daten von Zeitmesser'!B:B,SMALL(IF('Daten von Zeitmesser'!$A$2:$A$100=108,ROW('Daten von Zeitmesser'!$2:$100)),ROW($A$1))))","v":0},{"$f":"IF(ROW('Daten von Zeitmesser'!$1:$1)>COUNTIF('Daten von Zeitmesser'!$A:$A,108),0,INDEX('Daten von Zeitmesser'!C:C,SMALL(IF('Daten von Zeitmesser'!$A$2:$A$100=108,ROW('Daten von Zeitmesser'!$2:$100)),ROW($A$1))))","v":0},{"$f":"IF(ROW('Daten von Zeitmesser'!$1:$1)>COUNTIF('Daten von Zeitmesser'!$A:$A,108),\"128\",INDEX('Daten von Zeitmesser'!D:D,SMALL(IF('Daten von Zeitmesser'!$A$2:$A$100=108,ROW('Daten von Zeitmesser'!$2:$100)),ROW($A$1))))","v":"128"}]
[{"$f":"IF(ROW('Daten von Zeitmesser'!$1:$1)>COUNTIF('Daten von Zeitmesser'!$A:$A,208),\"\",INDEX('Daten von Zeitmesser'!A:A,SMALL(IF('Daten von Zeitmesser'!$A$2:$A$100=208,ROW('Daten von Zeitmesser'!$2:$100)),ROW($A$1))))","v":""},{"$f":"IF(ROW('Daten von Zeitmesser'!$1:$1)>COUNTIF('Daten von Zeitmesser'!$A:$A,208),0,INDEX('Daten von Zeitmesser'!B:B,SMALL(IF('Daten von Zeitmesser'!$A$2:$A$100=208,ROW('Daten von Zeitmesser'!$2:$100)),ROW($A$1))))","v":0},{"$f":"IF(ROW('Daten von Zeitmesser'!$1:$1)>COUNTIF('Daten von Zeitmesser'!$A:$A,208),0,INDEX('Daten von Zeitmesser'!C:C,SMALL(IF('Daten von Zeitmesser'!$A$2:$A$100=208,ROW('Daten von Zeitmesser'!$2:$100)),ROW($A$1))))","v":0},{"$f":"IF(ROW('Daten von Zeitmesser'!$1:$1)>COUNTIF('Daten von Zeitmesser'!$A:$A,208),\"129\",INDEX('Daten von Zeitmesser'!D:D,SMALL(IF('Daten von Zeitmesser'!$A$2:$A$100=208,ROW('Daten von Zeitmesser'!$2:$100)),ROW($A$1))))","v":"129"}]
[{"$f":"IF(ROW('Daten von Zeitmesser'!$1:$1)>COUNTIF('Daten von Zeitmesser'!$A:$A,308),\"\",INDEX('Daten von Zeitmesser'!A:A,SMALL(IF('Daten von Zeitmesser'!$A$2:$A$100=308,ROW('Daten von Zeitmesser'!$2:$100)),ROW($A$1))))","v":""},{"$f":"IF(ROW('Daten von Zeitmesser'!$1:$1)>COUNTIF('Daten von Zeitmesser'!$A:$A,308),0,INDEX('Daten von Zeitmesser'!B:B,SMALL(IF('Daten von Zeitmesser'!$A$2:$A$100=308,ROW('Daten von Zeitmesser'!$2:$100)),ROW($A$1))))","v":0},{"$f":"IF(ROW('Daten von Zeitmesser'!$1:$1)>COUNTIF('Daten von Zeitmesser'!$A:$A,308),0,INDEX('Daten von Zeitmesser'!C:C,SMALL(IF('Daten von Zeitmesser'!$A$2:$A$100=308,ROW('Daten von Zeitmesser'!$2:$100)),ROW($A$1))))","v":0},{"$f":"IF(ROW('Daten von Zeitmesser'!$1:$1)>COUNTIF('Daten von Zeitmesser'!$A:$A,308),\"130\",INDEX('Daten von Zeitmesser'!D:D,SMALL(IF('Daten von Zeitmesser'!$A$2:$A$100=308,ROW('Daten von Zeitmesser'!$2:$100)),ROW($A$1))))","v":"130"}]
[{"$f":"IF(ROW('Daten von Zeitmesser'!$1:$1)>COUNTIF('Daten von Zeitmesser'!$A:$A,408),\"\",INDEX('Daten von Zeitmesser'!A:A,SMALL(IF('Daten von Zeitmesser'!$A$2:$A$100=408,ROW('Daten von Zeitmesser'!$2:$100)),ROW($A$1))))","v":""},{"$f":"IF(ROW('Daten von Zeitmesser'!$1:$1)>COUNTIF('Daten von Zeitmesser'!$A:$A,408),0,INDEX('Daten von Zeitmesser'!B:B,SMALL(IF('Daten von Zeitmesser'!$A$2:$A$100=408,ROW('Daten von Zeitmesser'!$2:$100)),ROW($A$1))))","v":0},{"$f":"IF(ROW('Daten von Zeitmesser'!$1:$1)>COUNTIF('Daten von Zeitmesser'!$A:$A,408),0,INDEX('Daten von Zeitmesser'!C:C,SMALL(IF('Daten von Zeitmesser'!$A$2:$A$100=408,ROW('Daten von Zeitmesser'!$2:$100)),ROW($A$1))))","v":0},{"$f":"IF(ROW('Daten von Zeitmesser'!$1:$1)>COUNTIF('Daten von Zeitmesser'!$A:$A,408),\"131\",INDEX('Daten von Zeitmesser'!D:D,SMALL(IF('Daten von Zeitmesser'!$A$2:$A$100=408,ROW('Daten von Zeitmesser'!$2:$100)),ROW($A$1))))","v":"131"}]
[{"$f":"IF(ROW('Daten von Zeitmesser'!$1:$1)>COUNTIF('Daten von Zeitmesser'!$A:$A,109),\"\",INDEX('Daten von Zeitmesser'!A:A,SMALL(IF('Daten von Zeitmesser'!$A$2:$A$100=109,ROW('Daten von Zeitmesser'!$2:$100)),ROW($A$1))))","v":""},{"$f":"IF(ROW('Daten von Zeitmesser'!$1:$1)>COUNTIF('Daten von Zeitmesser'!$A:$A,109),0,INDEX('Daten von Zeitmesser'!B:B,SMALL(IF('Daten von Zeitmesser'!$A$2:$A$100=109,ROW('Daten von Zeitmesser'!$2:$100)),ROW($A$1))))","v":0},{"$f":"IF(ROW('Daten von Zeitmesser'!$1:$1)>COUNTIF('Daten von Zeitmesser'!$A:$A,109),0,INDEX('Daten von Zeitmesser'!C:C,SMALL(IF('Daten von Zeitmesser'!$A$2:$A$100=109,ROW('Daten von Zeitmesser'!$2:$100)),ROW($A$1))))","v":0},{"$f":"IF(ROW('Daten von Zeitmesser'!$1:$1)>COUNTIF('Daten von Zeitmesser'!$A:$A,109),\"132\",INDEX('Daten von Zeitmesser'!D:D,SMALL(IF('Daten von Zeitmesser'!$A$2:$A$100=109,ROW('Daten von Zeitmesser'!$2:$100)),ROW($A$1))))","v":"132"}]
[{"$f":"IF(ROW('Daten von Zeitmesser'!$1:$1)>COUNTIF('Daten von Zeitmesser'!$A:$A,209),\"\",INDEX('Daten von Zeitmesser'!A:A,SMALL(IF('Daten von Zeitmesser'!$A$2:$A$100=209,ROW('Daten von Zeitmesser'!$2:$100)),ROW($A$1))))","v":""},{"$f":"IF(ROW('Daten von Zeitmesser'!$1:$1)>COUNTIF('Daten von Zeitmesser'!$A:$A,209),0,INDEX('Daten von Zeitmesser'!B:B,SMALL(IF('Daten von Zeitmesser'!$A$2:$A$100=209,ROW('Daten von Zeitmesser'!$2:$100)),ROW($A$1))))","v":0},{"$f":"IF(ROW('Daten von Zeitmesser'!$1:$1)>COUNTIF('Daten von Zeitmesser'!$A:$A,209),0,INDEX('Daten von Zeitmesser'!C:C,SMALL(IF('Daten von Zeitmesser'!$A$2:$A$100=209,ROW('Daten von Zeitmesser'!$2:$100)),ROW($A$1))))","v":0},{"$f":"IF(ROW('Daten von Zeitmesser'!$1:$1)>COUNTIF('Daten von Zeitmesser'!$A:$A,209),\"133\",INDEX('Daten von Zeitmesser'!D:D,SMALL(IF('Daten von Zeitmesser'!$A$2:$A$100=209,ROW('Daten von Zeitmesser'!$2:$100)),ROW($A$1))))","v":"133"}]
[{"$f":"IF(ROW('Daten von Zeitmesser'!$1:$1)>COUNTIF('Daten von Zeitmesser'!$A:$A,309),\"\",INDEX('Daten von Zeitmesser'!A:A,SMALL(IF('Daten von Zeitmesser'!$A$2:$A$100=309,ROW('Daten von Zeitmesser'!$2:$100)),ROW($A$1))))","v":""},{"$f":"IF(ROW('Daten von Zeitmesser'!$1:$1)>COUNTIF('Daten von Zeitmesser'!$A:$A,309),0,INDEX('Daten von Zeitmesser'!B:B,SMALL(IF('Daten von Zeitmesser'!$A$2:$A$100=309,ROW('Daten von Zeitmesser'!$2:$100)),ROW($A$1))))","v":0},{"$f":"IF(ROW('Daten von Zeitmesser'!$1:$1)>COUNTIF('Daten von Zeitmesser'!$A:$A,309),0,INDEX('Daten von Zeitmesser'!C:C,SMALL(IF('Daten von Zeitmesser'!$A$2:$A$100=309,ROW('Daten von Zeitmesser'!$2:$100)),ROW($A$1))))","v":0},{"$f":"IF(ROW('Daten von Zeitmesser'!$1:$1)>COUNTIF('Daten von Zeitmesser'!$A:$A,309),\"134\",INDEX('Daten von Zeitmesser'!D:D,SMALL(IF('Daten von Zeitmesser'!$A$2:$A$100=309,ROW('Daten von Zeitmesser'!$2:$100)),ROW($A$1))))","v":"134"}]
[{"$f":"IF(ROW('Daten von Zeitmesser'!$1:$1)>COUNTIF('Daten von Zeitmesser'!$A:$A,409),\"\",INDEX('Daten von Zeitmesser'!A:A,SMALL(IF('Daten von Zeitmesser'!$A$2:$A$100=409,ROW('Daten von Zeitmesser'!$2:$100)),ROW($A$1))))","v":""},{"$f":"IF(ROW('Daten von Zeitmesser'!$1:$1)>COUNTIF('Daten von Zeitmesser'!$A:$A,409),0,INDEX('Daten von Zeitmesser'!B:B,SMALL(IF('Daten von Zeitmesser'!$A$2:$A$100=409,ROW('Daten von Zeitmesser'!$2:$100)),ROW($A$1))))","v":0},{"$f":"IF(ROW('Daten von Zeitmesser'!$1:$1)>COUNTIF('Daten von Zeitmesser'!$A:$A,409),0,INDEX('Daten von Zeitmesser'!C:C,SMALL(IF('Daten von Zeitmesser'!$A$2:$A$100=409,ROW('Daten von Zeitmesser'!$2:$100)),ROW($A$1))))","v":0},{"$f":"IF(ROW('Daten von Zeitmesser'!$1:$1)>COUNTIF('Daten von Zeitmesser'!$A:$A,409),\"135\",INDEX('Daten von Zeitmesser'!D:D,SMALL(IF('Daten von Zeitmesser'!$A$2:$A$100=409,ROW('Daten von Zeitmesser'!$2:$100)),ROW($A$1))))","v":"135"}]
[{"$f":"IF(ROW('Daten von Zeitmesser'!$1:$1)>COUNTIF('Daten von Zeitmesser'!$A:$A,110),\"\",INDEX('Daten von Zeitmesser'!A:A,SMALL(IF('Daten von Zeitmesser'!$A$2:$A$100=110,ROW('Daten von Zeitmesser'!$2:$100)),ROW($A$1))))","v":""},{"$f":"IF(ROW('Daten von Zeitmesser'!$1:$1)>COUNTIF('Daten von Zeitmesser'!$A:$A,110),0,INDEX('Daten von Zeitmesser'!B:B,SMALL(IF('Daten von Zeitmesser'!$A$2:$A$100=110,ROW('Daten von Zeitmesser'!$2:$100)),ROW($A$1))))","v":0},{"$f":"IF(ROW('Daten von Zeitmesser'!$1:$1)>COUNTIF('Daten von Zeitmesser'!$A:$A,110),0,INDEX('Daten von Zeitmesser'!C:C,SMALL(IF('Daten von Zeitmesser'!$A$2:$A$100=110,ROW('Daten von Zeitmesser'!$2:$100)),ROW($A$1))))","v":0},{"$f":"IF(ROW('Daten von Zeitmesser'!$1:$1)>COUNTIF('Daten von Zeitmesser'!$A:$A,110),\"136\",INDEX('Daten von Zeitmesser'!D:D,SMALL(IF('Daten von Zeitmesser'!$A$2:$A$100=110,ROW('Daten von Zeitmesser'!$2:$100)),ROW($A$1))))","v":"136"}]
[{"$f":"IF(ROW('Daten von Zeitmesser'!$1:$1)>COUNTIF('Daten von Zeitmesser'!$A:$A,210),\"\",INDEX('Daten von Zeitmesser'!A:A,SMALL(IF('Daten von Zeitmesser'!$A$2:$A$100=210,ROW('Daten von Zeitmesser'!$2:$100)),ROW($A$1))))","v":""},{"$f":"IF(ROW('Daten von Zeitmesser'!$1:$1)>COUNTIF('Daten von Zeitmesser'!$A:$A,210),0,INDEX('Daten von Zeitmesser'!B:B,SMALL(IF('Daten von Zeitmesser'!$A$2:$A$100=210,ROW('Daten von Zeitmesser'!$2:$100)),ROW($A$1))))","v":0},{"$f":"IF(ROW('Daten von Zeitmesser'!$1:$1)>COUNTIF('Daten von Zeitmesser'!$A:$A,210),0,INDEX('Daten von Zeitmesser'!C:C,SMALL(IF('Daten von Zeitmesser'!$A$2:$A$100=210,ROW('Daten von Zeitmesser'!$2:$100)),ROW($A$1))))","v":0},{"$f":"IF(ROW('Daten von Zeitmesser'!$1:$1)>COUNTIF('Daten von Zeitmesser'!$A:$A,210),\"137\",INDEX('Daten von Zeitmesser'!D:D,SMALL(IF('Daten von Zeitmesser'!$A$2:$A$100=210,ROW('Daten von Zeitmesser'!$2:$100)),ROW($A$1))))","v":"137"}]
[{"$f":"IF(ROW('Daten von Zeitmesser'!$1:$1)>COUNTIF('Daten von Zeitmesser'!$A:$A,310),\"\",INDEX('Daten von Zeitmesser'!A:A,SMALL(IF('Daten von Zeitmesser'!$A$2:$A$100=310,ROW('Daten von Zeitmesser'!$2:$100)),ROW($A$1))))","v":""},{"$f":"IF(ROW('Daten von Zeitmesser'!$1:$1)>COUNTIF('Daten von Zeitmesser'!$A:$A,310),0,INDEX('Daten von Zeitmesser'!B:B,SMALL(IF('Daten von Zeitmesser'!$A$2:$A$100=310,ROW('Daten von Zeitmesser'!$2:$100)),ROW($A$1))))","v":0},{"$f":"IF(ROW('Daten von Zeitmesser'!$1:$1)>COUNTIF('Daten von Zeitmesser'!$A:$A,310),0,INDEX('Daten von Zeitmesser'!C:C,SMALL(IF('Daten von Zeitmesser'!$A$2:$A$100=310,ROW('Daten von Zeitmesser'!$2:$100)),ROW($A$1))))","v":0},{"$f":"IF(ROW('Daten von Zeitmesser'!$1:$1)>COUNTIF('Daten von Zeitmesser'!$A:$A,310),\"138\",INDEX('Daten von Zeitmesser'!D:D,SMALL(IF('Daten von Zeitmesser'!$A$2:$A$100=310,ROW('Daten von Zeitmesser'!$2:$100)),ROW($A$1))))","v":"138"}]
[{"$f":"IF(ROW('Daten von Zeitmesser'!$1:$1)>COUNTIF('Daten von Zeitmesser'!$A:$A,410),\"\",INDEX('Daten von Zeitmesser'!A:A,SMALL(IF('Daten von Zeitmesser'!$A$2:$A$100=410,ROW('Daten von Zeitmesser'!$2:$100)),ROW($A$1))))","v":""},{"$f":"IF(ROW('Daten von Zeitmesser'!$1:$1)>COUNTIF('Daten von Zeitmesser'!$A:$A,410),0,INDEX('Daten von Zeitmesser'!B:B,SMALL(IF('Daten von Zeitmesser'!$A$2:$A$100=410,ROW('Daten von Zeitmesser'!$2:$100)),ROW($A$1))))","v":0},{"$f":"IF(ROW('Daten von Zeitmesser'!$1:$1)>COUNTIF('Daten von Zeitmesser'!$A:$A,410),0,INDEX('Daten von Zeitmesser'!C:C,SMALL(IF('Daten von Zeitmesser'!$A$2:$A$100=410,ROW('Daten von Zeitmesser'!$2:$100)),ROW($A$1))))","v":0},{"$f":"IF(ROW('Daten von Zeitmesser'!$1:$1)>COUNTIF('Daten von Zeitmesser'!$A:$A,410),\"139\",INDEX('Daten von Zeitmesser'!D:D,SMALL(IF('Daten von Zeitmesser'!$A$2:$A$100=410,ROW('Daten von Zeitmesser'!$2:$100)),ROW($A$1))))","v":"139"}]
[{"$f":"IF(ROW('Daten von Zeitmesser'!$1:$1)>COUNTIF('Daten von Zeitmesser'!$A:$A,111),\"\",INDEX('Daten von Zeitmesser'!A:A,SMALL(IF('Daten von Zeitmesser'!$A$2:$A$100=111,ROW('Daten von Zeitmesser'!$2:$100)),ROW($A$1))))","v":""},{"$f":"IF(ROW('Daten von Zeitmesser'!$1:$1)>COUNTIF('Daten von Zeitmesser'!$A:$A,111),0,INDEX('Daten von Zeitmesser'!B:B,SMALL(IF('Daten von Zeitmesser'!$A$2:$A$100=111,ROW('Daten von Zeitmesser'!$2:$100)),ROW($A$1))))","v":0},{"$f":"IF(ROW('Daten von Zeitmesser'!$1:$1)>COUNTIF('Daten von Zeitmesser'!$A:$A,111),0,INDEX('Daten von Zeitmesser'!C:C,SMALL(IF('Daten von Zeitmesser'!$A$2:$A$100=111,ROW('Daten von Zeitmesser'!$2:$100)),ROW($A$1))))","v":0},{"$f":"IF(ROW('Daten von Zeitmesser'!$1:$1)>COUNTIF('Daten von Zeitmesser'!$A:$A,111),\"140\",INDEX('Daten von Zeitmesser'!D:D,SMALL(IF('Daten von Zeitmesser'!$A$2:$A$100=111,ROW('Daten von Zeitmesser'!$2:$100)),ROW($A$1))))","v":"140"}]
[{"$f":"IF(ROW('Daten von Zeitmesser'!$1:$1)>COUNTIF('Daten von Zeitmesser'!$A:$A,211),\"\",INDEX('Daten von Zeitmesser'!A:A,SMALL(IF('Daten von Zeitmesser'!$A$2:$A$100=211,ROW('Daten von Zeitmesser'!$2:$100)),ROW($A$1))))","v":""},{"$f":"IF(ROW('Daten von Zeitmesser'!$1:$1)>COUNTIF('Daten von Zeitmesser'!$A:$A,211),0,INDEX('Daten von Zeitmesser'!B:B,SMALL(IF('Daten von Zeitmesser'!$A$2:$A$100=211,ROW('Daten von Zeitmesser'!$2:$100)),ROW($A$1))))","v":0},{"$f":"IF(ROW('Daten von Zeitmesser'!$1:$1)>COUNTIF('Daten von Zeitmesser'!$A:$A,211),0,INDEX('Daten von Zeitmesser'!C:C,SMALL(IF('Daten von Zeitmesser'!$A$2:$A$100=211,ROW('Daten von Zeitmesser'!$2:$100)),ROW($A$1))))","v":0},{"$f":"IF(ROW('Daten von Zeitmesser'!$1:$1)>COUNTIF('Daten von Zeitmesser'!$A:$A,211),\"141\",INDEX('Daten von Zeitmesser'!D:D,SMALL(IF('Daten von Zeitmesser'!$A$2:$A$100=211,ROW('Daten von Zeitmesser'!$2:$100)),ROW($A$1))))","v":"141"}]
[{"$f":"IF(ROW('Daten von Zeitmesser'!$1:$1)>COUNTIF('Daten von Zeitmesser'!$A:$A,311),\"\",INDEX('Daten von Zeitmesser'!A:A,SMALL(IF('Daten von Zeitmesser'!$A$2:$A$100=311,ROW('Daten von Zeitmesser'!$2:$100)),ROW($A$1))))","v":""},{"$f":"IF(ROW('Daten von Zeitmesser'!$1:$1)>COUNTIF('Daten von Zeitmesser'!$A:$A,311),0,INDEX('Daten von Zeitmesser'!B:B,SMALL(IF('Daten von Zeitmesser'!$A$2:$A$100=311,ROW('Daten von Zeitmesser'!$2:$100)),ROW($A$1))))","v":0},{"$f":"IF(ROW('Daten von Zeitmesser'!$1:$1)>COUNTIF('Daten von Zeitmesser'!$A:$A,311),0,INDEX('Daten von Zeitmesser'!C:C,SMALL(IF('Daten von Zeitmesser'!$A$2:$A$100=311,ROW('Daten von Zeitmesser'!$2:$100)),ROW($A$1))))","v":0},{"$f":"IF(ROW('Daten von Zeitmesser'!$1:$1)>COUNTIF('Daten von Zeitmesser'!$A:$A,311),\"142\",INDEX('Daten von Zeitmesser'!D:D,SMALL(IF('Daten von Zeitmesser'!$A$2:$A$100=311,ROW('Daten von Zeitmesser'!$2:$100)),ROW($A$1))))","v":"142"}]
[{"$f":"IF(ROW('Daten von Zeitmesser'!$1:$1)>COUNTIF('Daten von Zeitmesser'!$A:$A,411),\"\",INDEX('Daten von Zeitmesser'!A:A,SMALL(IF('Daten von Zeitmesser'!$A$2:$A$100=411,ROW('Daten von Zeitmesser'!$2:$100)),ROW($A$1))))","v":""},{"$f":"IF(ROW('Daten von Zeitmesser'!$1:$1)>COUNTIF('Daten von Zeitmesser'!$A:$A,411),0,INDEX('Daten von Zeitmesser'!B:B,SMALL(IF('Daten von Zeitmesser'!$A$2:$A$100=411,ROW('Daten von Zeitmesser'!$2:$100)),ROW($A$1))))","v":0},{"$f":"IF(ROW('Daten von Zeitmesser'!$1:$1)>COUNTIF('Daten von Zeitmesser'!$A:$A,411),0,INDEX('Daten von Zeitmesser'!C:C,SMALL(IF('Daten von Zeitmesser'!$A$2:$A$100=411,ROW('Daten von Zeitmesser'!$2:$100)),ROW($A$1))))","v":0},{"$f":"IF(ROW('Daten von Zeitmesser'!$1:$1)>COUNTIF('Daten von Zeitmesser'!$A:$A,411),\"143\",INDEX('Daten von Zeitmesser'!D:D,SMALL(IF('Daten von Zeitmesser'!$A$2:$A$100=411,ROW('Daten von Zeitmesser'!$2:$100)),ROW($A$1))))","v":"143"}]
[{"$f":"IF(ROW('Daten von Zeitmesser'!$1:$1)>COUNTIF('Daten von Zeitmesser'!$A:$A,112),\"\",INDEX('Daten von Zeitmesser'!A:A,SMALL(IF('Daten von Zeitmesser'!$A$2:$A$100=112,ROW('Daten von Zeitmesser'!$2:$100)),ROW($A$1))))","v":""},{"$f":"IF(ROW('Daten von Zeitmesser'!$1:$1)>COUNTIF('Daten von Zeitmesser'!$A:$A,112),0,INDEX('Daten von Zeitmesser'!B:B,SMALL(IF('Daten von Zeitmesser'!$A$2:$A$100=112,ROW('Daten von Zeitmesser'!$2:$100)),ROW($A$1))))","v":0},{"$f":"IF(ROW('Daten von Zeitmesser'!$1:$1)>COUNTIF('Daten von Zeitmesser'!$A:$A,112),0,INDEX('Daten von Zeitmesser'!C:C,SMALL(IF('Daten von Zeitmesser'!$A$2:$A$100=112,ROW('Daten von Zeitmesser'!$2:$100)),ROW($A$1))))","v":0},{"$f":"IF(ROW('Daten von Zeitmesser'!$1:$1)>COUNTIF('Daten von Zeitmesser'!$A:$A,112),\"144\",INDEX('Daten von Zeitmesser'!D:D,SMALL(IF('Daten von Zeitmesser'!$A$2:$A$100=112,ROW('Daten von Zeitmesser'!$2:$100)),ROW($A$1))))","v":"144"}]
[{"$f":"IF(ROW('Daten von Zeitmesser'!$1:$1)>COUNTIF('Daten von Zeitmesser'!$A:$A,212),\"\",INDEX('Daten von Zeitmesser'!A:A,SMALL(IF('Daten von Zeitmesser'!$A$2:$A$100=212,ROW('Daten von Zeitmesser'!$2:$100)),ROW($A$1))))","v":""},{"$f":"IF(ROW('Daten von Zeitmesser'!$1:$1)>COUNTIF('Daten von Zeitmesser'!$A:$A,212),0,INDEX('Daten von Zeitmesser'!B:B,SMALL(IF('Daten von Zeitmesser'!$A$2:$A$100=212,ROW('Daten von Zeitmesser'!$2:$100)),ROW($A$1))))","v":0},{"$f":"IF(ROW('Daten von Zeitmesser'!$1:$1)>COUNTIF('Daten von Zeitmesser'!$A:$A,212),0,INDEX('Daten von Zeitmesser'!C:C,SMALL(IF('Daten von Zeitmesser'!$A$2:$A$100=212,ROW('Daten von Zeitmesser'!$2:$100)),ROW($A$1))))","v":0},{"$f":"IF(ROW('Daten von Zeitmesser'!$1:$1)>COUNTIF('Daten von Zeitmesser'!$A:$A,212),\"145\",INDEX('Daten von Zeitmesser'!D:D,SMALL(IF('Daten von Zeitmesser'!$A$2:$A$100=212,ROW('Daten von Zeitmesser'!$2:$100)),ROW($A$1))))","v":"145"}]
[{"$f":"IF(ROW('Daten von Zeitmesser'!$1:$1)>COUNTIF('Daten von Zeitmesser'!$A:$A,312),\"\",INDEX('Daten von Zeitmesser'!A:A,SMALL(IF('Daten von Zeitmesser'!$A$2:$A$100=312,ROW('Daten von Zeitmesser'!$2:$100)),ROW($A$1))))","v":""},{"$f":"IF(ROW('Daten von Zeitmesser'!$1:$1)>COUNTIF('Daten von Zeitmesser'!$A:$A,312),0,INDEX('Daten von Zeitmesser'!B:B,SMALL(IF('Daten von Zeitmesser'!$A$2:$A$100=312,ROW('Daten von Zeitmesser'!$2:$100)),ROW($A$1))))","v":0},{"$f":"IF(ROW('Daten von Zeitmesser'!$1:$1)>COUNTIF('Daten von Zeitmesser'!$A:$A,312),0,INDEX('Daten von Zeitmesser'!C:C,SMALL(IF('Daten von Zeitmesser'!$A$2:$A$100=312,ROW('Daten von Zeitmesser'!$2:$100)),ROW($A$1))))","v":0},{"$f":"IF(ROW('Daten von Zeitmesser'!$1:$1)>COUNTIF('Daten von Zeitmesser'!$A:$A,312),\"146\",INDEX('Daten von Zeitmesser'!D:D,SMALL(IF('Daten von Zeitmesser'!$A$2:$A$100=312,ROW('Daten von Zeitmesser'!$2:$100)),ROW($A$1))))","v":"146"}]
[{"$f":"IF(ROW('Daten von Zeitmesser'!$1:$1)>COUNTIF('Daten von Zeitmesser'!$A:$A,412),\"\",INDEX('Daten von Zeitmesser'!A:A,SMALL(IF('Daten von Zeitmesser'!$A$2:$A$100=412,ROW('Daten von Zeitmesser'!$2:$100)),ROW($A$1))))","v":""},{"$f":"IF(ROW('Daten von Zeitmesser'!$1:$1)>COUNTIF('Daten von Zeitmesser'!$A:$A,412),0,INDEX('Daten von Zeitmesser'!B:B,SMALL(IF('Daten von Zeitmesser'!$A$2:$A$100=412,ROW('Daten von Zeitmesser'!$2:$100)),ROW($A$1))))","v":0},{"$f":"IF(ROW('Daten von Zeitmesser'!$1:$1)>COUNTIF('Daten von Zeitmesser'!$A:$A,412),0,INDEX('Daten von Zeitmesser'!C:C,SMALL(IF('Daten von Zeitmesser'!$A$2:$A$100=412,ROW('Daten von Zeitmesser'!$2:$100)),ROW($A$1))))","v":0},{"$f":"IF(ROW('Daten von Zeitmesser'!$1:$1)>COUNTIF('Daten von Zeitmesser'!$A:$A,412),\"147\",INDEX('Daten von Zeitmesser'!D:D,SMALL(IF('Daten von Zeitmesser'!$A$2:$A$100=412,ROW('Daten von Zeitmesser'!$2:$100)),ROW($A$1))))","v":"147"}]
[{"$f":"IF(ROW('Daten von Zeitmesser'!$1:$1)>COUNTIF('Daten von Zeitmesser'!$A:$A,113),\"\",INDEX('Daten von Zeitmesser'!A:A,SMALL(IF('Daten von Zeitmesser'!$A$2:$A$100=113,ROW('Daten von Zeitmesser'!$2:$100)),ROW($A$1))))","v":""},{"$f":"IF(ROW('Daten von Zeitmesser'!$1:$1)>COUNTIF('Daten von Zeitmesser'!$A:$A,113),0,INDEX('Daten von Zeitmesser'!B:B,SMALL(IF('Daten von Zeitmesser'!$A$2:$A$100=113,ROW('Daten von Zeitmesser'!$2:$100)),ROW($A$1))))","v":0},{"$f":"IF(ROW('Daten von Zeitmesser'!$1:$1)>COUNTIF('Daten von Zeitmesser'!$A:$A,113),0,INDEX('Daten von Zeitmesser'!C:C,SMALL(IF('Daten von Zeitmesser'!$A$2:$A$100=113,ROW('Daten von Zeitmesser'!$2:$100)),ROW($A$1))))","v":0},{"$f":"IF(ROW('Daten von Zeitmesser'!$1:$1)>COUNTIF('Daten von Zeitmesser'!$A:$A,113),\"148\",INDEX('Daten von Zeitmesser'!D:D,SMALL(IF('Daten von Zeitmesser'!$A$2:$A$100=113,ROW('Daten von Zeitmesser'!$2:$100)),ROW($A$1))))","v":"148"}]
[{"$f":"IF(ROW('Daten von Zeitmesser'!$1:$1)>COUNTIF('Daten von Zeitmesser'!$A:$A,213),\"\",INDEX('Daten von Zeitmesser'!A:A,SMALL(IF('Daten von Zeitmesser'!$A$2:$A$100=213,ROW('Daten von Zeitmesser'!$2:$100)),ROW($A$1))))","v":""},{"$f":"IF(ROW('Daten von Zeitmesser'!$1:$1)>COUNTIF('Daten von Zeitmesser'!$A:$A,213),0,INDEX('Daten von Zeitmesser'!B:B,SMALL(IF('Daten von Zeitmesser'!$A$2:$A$100=213,ROW('Daten von Zeitmesser'!$2:$100)),ROW($A$1))))","v":0},{"$f":"IF(ROW('Daten von Zeitmesser'!$1:$1)>COUNTIF('Daten von Zeitmesser'!$A:$A,213),0,INDEX('Daten von Zeitmesser'!C:C,SMALL(IF('Daten von Zeitmesser'!$A$2:$A$100=213,ROW('Daten von Zeitmesser'!$2:$100)),ROW($A$1))))","v":0},{"$f":"IF(ROW('Daten von Zeitmesser'!$1:$1)>COUNTIF('Daten von Zeitmesser'!$A:$A,213),\"149\",INDEX('Daten von Zeitmesser'!D:D,SMALL(IF('Daten von Zeitmesser'!$A$2:$A$100=213,ROW('Daten von Zeitmesser'!$2:$100)),ROW($A$1))))","v":"149"}]
[{"$f":"IF(ROW('Daten von Zeitmesser'!$1:$1)>COUNTIF('Daten von Zeitmesser'!$A:$A,313),\"\",INDEX('Daten von Zeitmesser'!A:A,SMALL(IF('Daten von Zeitmesser'!$A$2:$A$100=313,ROW('Daten von Zeitmesser'!$2:$100)),ROW($A$1))))","v":""},{"$f":"IF(ROW('Daten von Zeitmesser'!$1:$1)>COUNTIF('Daten von Zeitmesser'!$A:$A,313),0,INDEX('Daten von Zeitmesser'!B:B,SMALL(IF('Daten von Zeitmesser'!$A$2:$A$100=313,ROW('Daten von Zeitmesser'!$2:$100)),ROW($A$1))))","v":0},{"$f":"IF(ROW('Daten von Zeitmesser'!$1:$1)>COUNTIF('Daten von Zeitmesser'!$A:$A,313),0,INDEX('Daten von Zeitmesser'!C:C,SMALL(IF('Daten von Zeitmesser'!$A$2:$A$100=313,ROW('Daten von Zeitmesser'!$2:$100)),ROW($A$1))))","v":0},{"$f":"IF(ROW('Daten von Zeitmesser'!$1:$1)>COUNTIF('Daten von Zeitmesser'!$A:$A,313),\"150\",INDEX('Daten von Zeitmesser'!D:D,SMALL(IF('Daten von Zeitmesser'!$A$2:$A$100=313,ROW('Daten von Zeitmesser'!$2:$100)),ROW($A$1))))","v":"150"}]
[{"$f":"IF(ROW('Daten von Zeitmesser'!$1:$1)>COUNTIF('Daten von Zeitmesser'!$A:$A,413),\"\",INDEX('Daten von Zeitmesser'!A:A,SMALL(IF('Daten von Zeitmesser'!$A$2:$A$100=413,ROW('Daten von Zeitmesser'!$2:$100)),ROW($A$1))))","v":""},{"$f":"IF(ROW('Daten von Zeitmesser'!$1:$1)>COUNTIF('Daten von Zeitmesser'!$A:$A,413),0,INDEX('Daten von Zeitmesser'!B:B,SMALL(IF('Daten von Zeitmesser'!$A$2:$A$100=413,ROW('Daten von Zeitmesser'!$2:$100)),ROW($A$1))))","v":0},{"$f":"IF(ROW('Daten von Zeitmesser'!$1:$1)>COUNTIF('Daten von Zeitmesser'!$A:$A,413),0,INDEX('Daten von Zeitmesser'!C:C,SMALL(IF('Daten von Zeitmesser'!$A$2:$A$100=413,ROW('Daten von Zeitmesser'!$2:$100)),ROW($A$1))))","v":0},{"$f":"IF(ROW('Daten von Zeitmesser'!$1:$1)>COUNTIF('Daten von Zeitmesser'!$A:$A,413),\"151\",INDEX('Daten von Zeitmesser'!D:D,SMALL(IF('Daten von Zeitmesser'!$A$2:$A$100=413,ROW('Daten von Zeitmesser'!$2:$100)),ROW($A$1))))","v":"151"}]
[{"$f":"IF(ROW('Daten von Zeitmesser'!$1:$1)>COUNTIF('Daten von Zeitmesser'!$A:$A,114),\"\",INDEX('Daten von Zeitmesser'!A:A,SMALL(IF('Daten von Zeitmesser'!$A$2:$A$100=114,ROW('Daten von Zeitmesser'!$2:$100)),ROW($A$1))))","v":""},{"$f":"IF(ROW('Daten von Zeitmesser'!$1:$1)>COUNTIF('Daten von Zeitmesser'!$A:$A,114),0,INDEX('Daten von Zeitmesser'!B:B,SMALL(IF('Daten von Zeitmesser'!$A$2:$A$100=114,ROW('Daten von Zeitmesser'!$2:$100)),ROW($A$1))))","v":0},{"$f":"IF(ROW('Daten von Zeitmesser'!$1:$1)>COUNTIF('Daten von Zeitmesser'!$A:$A,114),0,INDEX('Daten von Zeitmesser'!C:C,SMALL(IF('Daten von Zeitmesser'!$A$2:$A$100=114,ROW('Daten von Zeitmesser'!$2:$100)),ROW($A$1))))","v":0},{"$f":"IF(ROW('Daten von Zeitmesser'!$1:$1)>COUNTIF('Daten von Zeitmesser'!$A:$A,114),\"152\",INDEX('Daten von Zeitmesser'!D:D,SMALL(IF('Daten von Zeitmesser'!$A$2:$A$100=114,ROW('Daten von Zeitmesser'!$2:$100)),ROW($A$1))))","v":"152"}]
[{"$f":"IF(ROW('Daten von Zeitmesser'!$1:$1)>COUNTIF('Daten von Zeitmesser'!$A:$A,214),\"\",INDEX('Daten von Zeitmesser'!A:A,SMALL(IF('Daten von Zeitmesser'!$A$2:$A$100=214,ROW('Daten von Zeitmesser'!$2:$100)),ROW($A$1))))","v":""},{"$f":"IF(ROW('Daten von Zeitmesser'!$1:$1)>COUNTIF('Daten von Zeitmesser'!$A:$A,214),0,INDEX('Daten von Zeitmesser'!B:B,SMALL(IF('Daten von Zeitmesser'!$A$2:$A$100=214,ROW('Daten von Zeitmesser'!$2:$100)),ROW($A$1))))","v":0},{"$f":"IF(ROW('Daten von Zeitmesser'!$1:$1)>COUNTIF('Daten von Zeitmesser'!$A:$A,214),0,INDEX('Daten von Zeitmesser'!C:C,SMALL(IF('Daten von Zeitmesser'!$A$2:$A$100=214,ROW('Daten von Zeitmesser'!$2:$100)),ROW($A$1))))","v":0},{"$f":"IF(ROW('Daten von Zeitmesser'!$1:$1)>COUNTIF('Daten von Zeitmesser'!$A:$A,214),\"153\",INDEX('Daten von Zeitmesser'!D:D,SMALL(IF('Daten von Zeitmesser'!$A$2:$A$100=214,ROW('Daten von Zeitmesser'!$2:$100)),ROW($A$1))))","v":"153"}]
[{"$f":"IF(ROW('Daten von Zeitmesser'!$1:$1)>COUNTIF('Daten von Zeitmesser'!$A:$A,314),\"\",INDEX('Daten von Zeitmesser'!A:A,SMALL(IF('Daten von Zeitmesser'!$A$2:$A$100=314,ROW('Daten von Zeitmesser'!$2:$100)),ROW($A$1))))","v":""},{"$f":"IF(ROW('Daten von Zeitmesser'!$1:$1)>COUNTIF('Daten von Zeitmesser'!$A:$A,314),0,INDEX('Daten von Zeitmesser'!B:B,SMALL(IF('Daten von Zeitmesser'!$A$2:$A$100=314,ROW('Daten von Zeitmesser'!$2:$100)),ROW($A$1))))","v":0},{"$f":"IF(ROW('Daten von Zeitmesser'!$1:$1)>COUNTIF('Daten von Zeitmesser'!$A:$A,314),0,INDEX('Daten von Zeitmesser'!C:C,SMALL(IF('Daten von Zeitmesser'!$A$2:$A$100=314,ROW('Daten von Zeitmesser'!$2:$100)),ROW($A$1))))","v":0},{"$f":"IF(ROW('Daten von Zeitmesser'!$1:$1)>COUNTIF('Daten von Zeitmesser'!$A:$A,314),\"154\",INDEX('Daten von Zeitmesser'!D:D,SMALL(IF('Daten von Zeitmesser'!$A$2:$A$100=314,ROW('Daten von Zeitmesser'!$2:$100)),ROW($A$1))))","v":"154"}]
[{"$f":"IF(ROW('Daten von Zeitmesser'!$1:$1)>COUNTIF('Daten von Zeitmesser'!$A:$A,414),\"\",INDEX('Daten von Zeitmesser'!A:A,SMALL(IF('Daten von Zeitmesser'!$A$2:$A$100=414,ROW('Daten von Zeitmesser'!$2:$100)),ROW($A$1))))","v":""},{"$f":"IF(ROW('Daten von Zeitmesser'!$1:$1)>COUNTIF('Daten von Zeitmesser'!$A:$A,414),0,INDEX('Daten von Zeitmesser'!B:B,SMALL(IF('Daten von Zeitmesser'!$A$2:$A$100=414,ROW('Daten von Zeitmesser'!$2:$100)),ROW($A$1))))","v":0},{"$f":"IF(ROW('Daten von Zeitmesser'!$1:$1)>COUNTIF('Daten von Zeitmesser'!$A:$A,414),0,INDEX('Daten von Zeitmesser'!C:C,SMALL(IF('Daten von Zeitmesser'!$A$2:$A$100=414,ROW('Daten von Zeitmesser'!$2:$100)),ROW($A$1))))","v":0},{"$f":"IF(ROW('Daten von Zeitmesser'!$1:$1)>COUNTIF('Daten von Zeitmesser'!$A:$A,414),\"155\",INDEX('Daten von Zeitmesser'!D:D,SMALL(IF('Daten von Zeitmesser'!$A$2:$A$100=414,ROW('Daten von Zeitmesser'!$2:$100)),ROW($A$1))))","v":"155"}]
[{"$f":"IF(ROW('Daten von Zeitmesser'!$1:$1)>COUNTIF('Daten von Zeitmesser'!$A:$A,115),\"\",INDEX('Daten von Zeitmesser'!A:A,SMALL(IF('Daten von Zeitmesser'!$A$2:$A$100=115,ROW('Daten von Zeitmesser'!$2:$100)),ROW($A$1))))","v":""},{"$f":"IF(ROW('Daten von Zeitmesser'!$1:$1)>COUNTIF('Daten von Zeitmesser'!$A:$A,115),0,INDEX('Daten von Zeitmesser'!B:B,SMALL(IF('Daten von Zeitmesser'!$A$2:$A$100=115,ROW('Daten von Zeitmesser'!$2:$100)),ROW($A$1))))","v":0},{"$f":"IF(ROW('Daten von Zeitmesser'!$1:$1)>COUNTIF('Daten von Zeitmesser'!$A:$A,115),0,INDEX('Daten von Zeitmesser'!C:C,SMALL(IF('Daten von Zeitmesser'!$A$2:$A$100=115,ROW('Daten von Zeitmesser'!$2:$100)),ROW($A$1))))","v":0},{"$f":"IF(ROW('Daten von Zeitmesser'!$1:$1)>COUNTIF('Daten von Zeitmesser'!$A:$A,115),\"156\",INDEX('Daten von Zeitmesser'!D:D,SMALL(IF('Daten von Zeitmesser'!$A$2:$A$100=115,ROW('Daten von Zeitmesser'!$2:$100)),ROW($A$1))))","v":"156"}]
[{"$f":"IF(ROW('Daten von Zeitmesser'!$1:$1)>COUNTIF('Daten von Zeitmesser'!$A:$A,215),\"\",INDEX('Daten von Zeitmesser'!A:A,SMALL(IF('Daten von Zeitmesser'!$A$2:$A$100=215,ROW('Daten von Zeitmesser'!$2:$100)),ROW($A$1))))","v":""},{"$f":"IF(ROW('Daten von Zeitmesser'!$1:$1)>COUNTIF('Daten von Zeitmesser'!$A:$A,215),0,INDEX('Daten von Zeitmesser'!B:B,SMALL(IF('Daten von Zeitmesser'!$A$2:$A$100=215,ROW('Daten von Zeitmesser'!$2:$100)),ROW($A$1))))","v":0},{"$f":"IF(ROW('Daten von Zeitmesser'!$1:$1)>COUNTIF('Daten von Zeitmesser'!$A:$A,215),0,INDEX('Daten von Zeitmesser'!C:C,SMALL(IF('Daten von Zeitmesser'!$A$2:$A$100=215,ROW('Daten von Zeitmesser'!$2:$100)),ROW($A$1))))","v":0},{"$f":"IF(ROW('Daten von Zeitmesser'!$1:$1)>COUNTIF('Daten von Zeitmesser'!$A:$A,215),\"157\",INDEX('Daten von Zeitmesser'!D:D,SMALL(IF('Daten von Zeitmesser'!$A$2:$A$100=215,ROW('Daten von Zeitmesser'!$2:$100)),ROW($A$1))))","v":"157"}]
[{"$f":"IF(ROW('Daten von Zeitmesser'!$1:$1)>COUNTIF('Daten von Zeitmesser'!$A:$A,315),\"\",INDEX('Daten von Zeitmesser'!A:A,SMALL(IF('Daten von Zeitmesser'!$A$2:$A$100=315,ROW('Daten von Zeitmesser'!$2:$100)),ROW($A$1))))","v":""},{"$f":"IF(ROW('Daten von Zeitmesser'!$1:$1)>COUNTIF('Daten von Zeitmesser'!$A:$A,315),0,INDEX('Daten von Zeitmesser'!B:B,SMALL(IF('Daten von Zeitmesser'!$A$2:$A$100=315,ROW('Daten von Zeitmesser'!$2:$100)),ROW($A$1))))","v":0},{"$f":"IF(ROW('Daten von Zeitmesser'!$1:$1)>COUNTIF('Daten von Zeitmesser'!$A:$A,315),0,INDEX('Daten von Zeitmesser'!C:C,SMALL(IF('Daten von Zeitmesser'!$A$2:$A$100=315,ROW('Daten von Zeitmesser'!$2:$100)),ROW($A$1))))","v":0},{"$f":"IF(ROW('Daten von Zeitmesser'!$1:$1)>COUNTIF('Daten von Zeitmesser'!$A:$A,315),\"158\",INDEX('Daten von Zeitmesser'!D:D,SMALL(IF('Daten von Zeitmesser'!$A$2:$A$100=315,ROW('Daten von Zeitmesser'!$2:$100)),ROW($A$1))))","v":"158"}]
[{"$f":"IF(ROW('Daten von Zeitmesser'!$1:$1)>COUNTIF('Daten von Zeitmesser'!$A:$A,415),\"\",INDEX('Daten von Zeitmesser'!A:A,SMALL(IF('Daten von Zeitmesser'!$A$2:$A$100=415,ROW('Daten von Zeitmesser'!$2:$100)),ROW($A$1))))","v":""},{"$f":"IF(ROW('Daten von Zeitmesser'!$1:$1)>COUNTIF('Daten von Zeitmesser'!$A:$A,415),0,INDEX('Daten von Zeitmesser'!B:B,SMALL(IF('Daten von Zeitmesser'!$A$2:$A$100=415,ROW('Daten von Zeitmesser'!$2:$100)),ROW($A$1))))","v":0},{"$f":"IF(ROW('Daten von Zeitmesser'!$1:$1)>COUNTIF('Daten von Zeitmesser'!$A:$A,415),0,INDEX('Daten von Zeitmesser'!C:C,SMALL(IF('Daten von Zeitmesser'!$A$2:$A$100=415,ROW('Daten von Zeitmesser'!$2:$100)),ROW($A$1))))","v":0},{"$f":"IF(ROW('Daten von Zeitmesser'!$1:$1)>COUNTIF('Daten von Zeitmesser'!$A:$A,415),\"159\",INDEX('Daten von Zeitmesser'!D:D,SMALL(IF('Daten von Zeitmesser'!$A$2:$A$100=415,ROW('Daten von Zeitmesser'!$2:$100)),ROW($A$1))))","v":"159"}]
[{"$f":"IF(ROW('Daten von Zeitmesser'!$1:$1)>COUNTIF('Daten von Zeitmesser'!$A:$A,116),\"\",INDEX('Daten von Zeitmesser'!A:A,SMALL(IF('Daten von Zeitmesser'!$A$2:$A$100=116,ROW('Daten von Zeitmesser'!$2:$100)),ROW($A$1))))","v":""},{"$f":"IF(ROW('Daten von Zeitmesser'!$1:$1)>COUNTIF('Daten von Zeitmesser'!$A:$A,116),0,INDEX('Daten von Zeitmesser'!B:B,SMALL(IF('Daten von Zeitmesser'!$A$2:$A$100=116,ROW('Daten von Zeitmesser'!$2:$100)),ROW($A$1))))","v":0},{"$f":"IF(ROW('Daten von Zeitmesser'!$1:$1)>COUNTIF('Daten von Zeitmesser'!$A:$A,116),0,INDEX('Daten von Zeitmesser'!C:C,SMALL(IF('Daten von Zeitmesser'!$A$2:$A$100=116,ROW('Daten von Zeitmesser'!$2:$100)),ROW($A$1))))","v":0},{"$f":"IF(ROW('Daten von Zeitmesser'!$1:$1)>COUNTIF('Daten von Zeitmesser'!$A:$A,116),\"160\",INDEX('Daten von Zeitmesser'!D:D,SMALL(IF('Daten von Zeitmesser'!$A$2:$A$100=116,ROW('Daten von Zeitmesser'!$2:$100)),ROW($A$1))))","v":"160"}]
[{"$f":"IF(ROW('Daten von Zeitmesser'!$1:$1)>COUNTIF('Daten von Zeitmesser'!$A:$A,216),\"\",INDEX('Daten von Zeitmesser'!A:A,SMALL(IF('Daten von Zeitmesser'!$A$2:$A$100=216,ROW('Daten von Zeitmesser'!$2:$100)),ROW($A$1))))","v":""},{"$f":"IF(ROW('Daten von Zeitmesser'!$1:$1)>COUNTIF('Daten von Zeitmesser'!$A:$A,216),0,INDEX('Daten von Zeitmesser'!B:B,SMALL(IF('Daten von Zeitmesser'!$A$2:$A$100=216,ROW('Daten von Zeitmesser'!$2:$100)),ROW($A$1))))","v":0},{"$f":"IF(ROW('Daten von Zeitmesser'!$1:$1)>COUNTIF('Daten von Zeitmesser'!$A:$A,216),0,INDEX('Daten von Zeitmesser'!C:C,SMALL(IF('Daten von Zeitmesser'!$A$2:$A$100=216,ROW('Daten von Zeitmesser'!$2:$100)),ROW($A$1))))","v":0},{"$f":"IF(ROW('Daten von Zeitmesser'!$1:$1)>COUNTIF('Daten von Zeitmesser'!$A:$A,216),\"161\",INDEX('Daten von Zeitmesser'!D:D,SMALL(IF('Daten von Zeitmesser'!$A$2:$A$100=216,ROW('Daten von Zeitmesser'!$2:$100)),ROW($A$1))))","v":"161"}]
[{"$f":"IF(ROW('Daten von Zeitmesser'!$1:$1)>COUNTIF('Daten von Zeitmesser'!$A:$A,316),\"\",INDEX('Daten von Zeitmesser'!A:A,SMALL(IF('Daten von Zeitmesser'!$A$2:$A$100=316,ROW('Daten von Zeitmesser'!$2:$100)),ROW($A$1))))","v":""},{"$f":"IF(ROW('Daten von Zeitmesser'!$1:$1)>COUNTIF('Daten von Zeitmesser'!$A:$A,316),0,INDEX('Daten von Zeitmesser'!B:B,SMALL(IF('Daten von Zeitmesser'!$A$2:$A$100=316,ROW('Daten von Zeitmesser'!$2:$100)),ROW($A$1))))","v":0},{"$f":"IF(ROW('Daten von Zeitmesser'!$1:$1)>COUNTIF('Daten von Zeitmesser'!$A:$A,316),0,INDEX('Daten von Zeitmesser'!C:C,SMALL(IF('Daten von Zeitmesser'!$A$2:$A$100=316,ROW('Daten von Zeitmesser'!$2:$100)),ROW($A$1))))","v":0},{"$f":"IF(ROW('Daten von Zeitmesser'!$1:$1)>COUNTIF('Daten von Zeitmesser'!$A:$A,316),\"162\",INDEX('Daten von Zeitmesser'!D:D,SMALL(IF('Daten von Zeitmesser'!$A$2:$A$100=316,ROW('Daten von Zeitmesser'!$2:$100)),ROW($A$1))))","v":"162"}]
[{"$f":"IF(ROW('Daten von Zeitmesser'!$1:$1)>COUNTIF('Daten von Zeitmesser'!$A:$A,416),\"\",INDEX('Daten von Zeitmesser'!A:A,SMALL(IF('Daten von Zeitmesser'!$A$2:$A$100=416,ROW('Daten von Zeitmesser'!$2:$100)),ROW($A$1))))","v":""},{"$f":"IF(ROW('Daten von Zeitmesser'!$1:$1)>COUNTIF('Daten von Zeitmesser'!$A:$A,416),0,INDEX('Daten von Zeitmesser'!B:B,SMALL(IF('Daten von Zeitmesser'!$A$2:$A$100=416,ROW('Daten von Zeitmesser'!$2:$100)),ROW($A$1))))","v":0},{"$f":"IF(ROW('Daten von Zeitmesser'!$1:$1)>COUNTIF('Daten von Zeitmesser'!$A:$A,416),0,INDEX('Daten von Zeitmesser'!C:C,SMALL(IF('Daten von Zeitmesser'!$A$2:$A$100=416,ROW('Daten von Zeitmesser'!$2:$100)),ROW($A$1))))","v":0},{"$f":"IF(ROW('Daten von Zeitmesser'!$1:$1)>COUNTIF('Daten von Zeitmesser'!$A:$A,416),\"163\",INDEX('Daten von Zeitmesser'!D:D,SMALL(IF('Daten von Zeitmesser'!$A$2:$A$100=416,ROW('Daten von Zeitmesser'!$2:$100)),ROW($A$1))))","v":"163"}]
[{"$f":"IF(ROW('Daten von Zeitmesser'!$1:$1)>COUNTIF('Daten von Zeitmesser'!$A:$A,117),\"\",INDEX('Daten von Zeitmesser'!A:A,SMALL(IF('Daten von Zeitmesser'!$A$2:$A$100=117,ROW('Daten von Zeitmesser'!$2:$100)),ROW($A$1))))","v":""},{"$f":"IF(ROW('Daten von Zeitmesser'!$1:$1)>COUNTIF('Daten von Zeitmesser'!$A:$A,117),0,INDEX('Daten von Zeitmesser'!B:B,SMALL(IF('Daten von Zeitmesser'!$A$2:$A$100=117,ROW('Daten von Zeitmesser'!$2:$100)),ROW($A$1))))","v":0},{"$f":"IF(ROW('Daten von Zeitmesser'!$1:$1)>COUNTIF('Daten von Zeitmesser'!$A:$A,117),0,INDEX('Daten von Zeitmesser'!C:C,SMALL(IF('Daten von Zeitmesser'!$A$2:$A$100=117,ROW('Daten von Zeitmesser'!$2:$100)),ROW($A$1))))","v":0},{"$f":"IF(ROW('Daten von Zeitmesser'!$1:$1)>COUNTIF('Daten von Zeitmesser'!$A:$A,117),\"164\",INDEX('Daten von Zeitmesser'!D:D,SMALL(IF('Daten von Zeitmesser'!$A$2:$A$100=117,ROW('Daten von Zeitmesser'!$2:$100)),ROW($A$1))))","v":"164"}]
[{"$f":"IF(ROW('Daten von Zeitmesser'!$1:$1)>COUNTIF('Daten von Zeitmesser'!$A:$A,217),\"\",INDEX('Daten von Zeitmesser'!A:A,SMALL(IF('Daten von Zeitmesser'!$A$2:$A$100=217,ROW('Daten von Zeitmesser'!$2:$100)),ROW($A$1))))","v":""},{"$f":"IF(ROW('Daten von Zeitmesser'!$1:$1)>COUNTIF('Daten von Zeitmesser'!$A:$A,217),0,INDEX('Daten von Zeitmesser'!B:B,SMALL(IF('Daten von Zeitmesser'!$A$2:$A$100=217,ROW('Daten von Zeitmesser'!$2:$100)),ROW($A$1))))","v":0},{"$f":"IF(ROW('Daten von Zeitmesser'!$1:$1)>COUNTIF('Daten von Zeitmesser'!$A:$A,217),0,INDEX('Daten von Zeitmesser'!C:C,SMALL(IF('Daten von Zeitmesser'!$A$2:$A$100=217,ROW('Daten von Zeitmesser'!$2:$100)),ROW($A$1))))","v":0},{"$f":"IF(ROW('Daten von Zeitmesser'!$1:$1)>COUNTIF('Daten von Zeitmesser'!$A:$A,217),\"165\",INDEX('Daten von Zeitmesser'!D:D,SMALL(IF('Daten von Zeitmesser'!$A$2:$A$100=217,ROW('Daten von Zeitmesser'!$2:$100)),ROW($A$1))))","v":"165"}]
[{"$f":"IF(ROW('Daten von Zeitmesser'!$1:$1)>COUNTIF('Daten von Zeitmesser'!$A:$A,317),\"\",INDEX('Daten von Zeitmesser'!A:A,SMALL(IF('Daten von Zeitmesser'!$A$2:$A$100=317,ROW('Daten von Zeitmesser'!$2:$100)),ROW($A$1))))","v":""},{"$f":"IF(ROW('Daten von Zeitmesser'!$1:$1)>COUNTIF('Daten von Zeitmesser'!$A:$A,317),0,INDEX('Daten von Zeitmesser'!B:B,SMALL(IF('Daten von Zeitmesser'!$A$2:$A$100=317,ROW('Daten von Zeitmesser'!$2:$100)),ROW($A$1))))","v":0},{"$f":"IF(ROW('Daten von Zeitmesser'!$1:$1)>COUNTIF('Daten von Zeitmesser'!$A:$A,317),0,INDEX('Daten von Zeitmesser'!C:C,SMALL(IF('Daten von Zeitmesser'!$A$2:$A$100=317,ROW('Daten von Zeitmesser'!$2:$100)),ROW($A$1))))","v":0},{"$f":"IF(ROW('Daten von Zeitmesser'!$1:$1)>COUNTIF('Daten von Zeitmesser'!$A:$A,317),\"166\",INDEX('Daten von Zeitmesser'!D:D,SMALL(IF('Daten von Zeitmesser'!$A$2:$A$100=317,ROW('Daten von Zeitmesser'!$2:$100)),ROW($A$1))))","v":"166"}]
[{"$f":"IF(ROW('Daten von Zeitmesser'!$1:$1)>COUNTIF('Daten von Zeitmesser'!$A:$A,417),\"\",INDEX('Daten von Zeitmesser'!A:A,SMALL(IF('Daten von Zeitmesser'!$A$2:$A$100=417,ROW('Daten von Zeitmesser'!$2:$100)),ROW($A$1))))","v":""},{"$f":"IF(ROW('Daten von Zeitmesser'!$1:$1)>COUNTIF('Daten von Zeitmesser'!$A:$A,417),0,INDEX('Daten von Zeitmesser'!B:B,SMALL(IF('Daten von Zeitmesser'!$A$2:$A$100=417,ROW('Daten von Zeitmesser'!$2:$100)),ROW($A$1))))","v":0},{"$f":"IF(ROW('Daten von Zeitmesser'!$1:$1)>COUNTIF('Daten von Zeitmesser'!$A:$A,417),0,INDEX('Daten von Zeitmesser'!C:C,SMALL(IF('Daten von Zeitmesser'!$A$2:$A$100=417,ROW('Daten von Zeitmesser'!$2:$100)),ROW($A$1))))","v":0},{"$f":"IF(ROW('Daten von Zeitmesser'!$1:$1)>COUNTIF('Daten von Zeitmesser'!$A:$A,417),\"167\",INDEX('Daten von Zeitmesser'!D:D,SMALL(IF('Daten von Zeitmesser'!$A$2:$A$100=417,ROW('Daten von Zeitmesser'!$2:$100)),ROW($A$1))))","v":"167"}]
[{"$f":"IF(ROW('Daten von Zeitmesser'!$1:$1)>COUNTIF('Daten von Zeitmesser'!$A:$A,118),\"\",INDEX('Daten von Zeitmesser'!A:A,SMALL(IF('Daten von Zeitmesser'!$A$2:$A$100=118,ROW('Daten von Zeitmesser'!$2:$100)),ROW($A$1))))","v":""},{"$f":"IF(ROW('Daten von Zeitmesser'!$1:$1)>COUNTIF('Daten von Zeitmesser'!$A:$A,118),0,INDEX('Daten von Zeitmesser'!B:B,SMALL(IF('Daten von Zeitmesser'!$A$2:$A$100=118,ROW('Daten von Zeitmesser'!$2:$100)),ROW($A$1))))","v":0},{"$f":"IF(ROW('Daten von Zeitmesser'!$1:$1)>COUNTIF('Daten von Zeitmesser'!$A:$A,118),0,INDEX('Daten von Zeitmesser'!C:C,SMALL(IF('Daten von Zeitmesser'!$A$2:$A$100=118,ROW('Daten von Zeitmesser'!$2:$100)),ROW($A$1))))","v":0},{"$f":"IF(ROW('Daten von Zeitmesser'!$1:$1)>COUNTIF('Daten von Zeitmesser'!$A:$A,118),\"168\",INDEX('Daten von Zeitmesser'!D:D,SMALL(IF('Daten von Zeitmesser'!$A$2:$A$100=118,ROW('Daten von Zeitmesser'!$2:$100)),ROW($A$1))))","v":"168"}]
[{"$f":"IF(ROW('Daten von Zeitmesser'!$1:$1)>COUNTIF('Daten von Zeitmesser'!$A:$A,218),\"\",INDEX('Daten von Zeitmesser'!A:A,SMALL(IF('Daten von Zeitmesser'!$A$2:$A$100=218,ROW('Daten von Zeitmesser'!$2:$100)),ROW($A$1))))","v":""},{"$f":"IF(ROW('Daten von Zeitmesser'!$1:$1)>COUNTIF('Daten von Zeitmesser'!$A:$A,218),0,INDEX('Daten von Zeitmesser'!B:B,SMALL(IF('Daten von Zeitmesser'!$A$2:$A$100=218,ROW('Daten von Zeitmesser'!$2:$100)),ROW($A$1))))","v":0},{"$f":"IF(ROW('Daten von Zeitmesser'!$1:$1)>COUNTIF('Daten von Zeitmesser'!$A:$A,218),0,INDEX('Daten von Zeitmesser'!C:C,SMALL(IF('Daten von Zeitmesser'!$A$2:$A$100=218,ROW('Daten von Zeitmesser'!$2:$100)),ROW($A$1))))","v":0},{"$f":"IF(ROW('Daten von Zeitmesser'!$1:$1)>COUNTIF('Daten von Zeitmesser'!$A:$A,218),\"169\",INDEX('Daten von Zeitmesser'!D:D,SMALL(IF('Daten von Zeitmesser'!$A$2:$A$100=218,ROW('Daten von Zeitmesser'!$2:$100)),ROW($A$1))))","v":"169"}]
[{"$f":"IF(ROW('Daten von Zeitmesser'!$1:$1)>COUNTIF('Daten von Zeitmesser'!$A:$A,318),\"\",INDEX('Daten von Zeitmesser'!A:A,SMALL(IF('Daten von Zeitmesser'!$A$2:$A$100=318,ROW('Daten von Zeitmesser'!$2:$100)),ROW($A$1))))","v":""},{"$f":"IF(ROW('Daten von Zeitmesser'!$1:$1)>COUNTIF('Daten von Zeitmesser'!$A:$A,318),0,INDEX('Daten von Zeitmesser'!B:B,SMALL(IF('Daten von Zeitmesser'!$A$2:$A$100=318,ROW('Daten von Zeitmesser'!$2:$100)),ROW($A$1))))","v":0},{"$f":"IF(ROW('Daten von Zeitmesser'!$1:$1)>COUNTIF('Daten von Zeitmesser'!$A:$A,318),0,INDEX('Daten von Zeitmesser'!C:C,SMALL(IF('Daten von Zeitmesser'!$A$2:$A$100=318,ROW('Daten von Zeitmesser'!$2:$100)),ROW($A$1))))","v":0},{"$f":"IF(ROW('Daten von Zeitmesser'!$1:$1)>COUNTIF('Daten von Zeitmesser'!$A:$A,318),\"170\",INDEX('Daten von Zeitmesser'!D:D,SMALL(IF('Daten von Zeitmesser'!$A$2:$A$100=318,ROW('Daten von Zeitmesser'!$2:$100)),ROW($A$1))))","v":"170"}]
[{"$f":"IF(ROW('Daten von Zeitmesser'!$1:$1)>COUNTIF('Daten von Zeitmesser'!$A:$A,418),\"\",INDEX('Daten von Zeitmesser'!A:A,SMALL(IF('Daten von Zeitmesser'!$A$2:$A$100=418,ROW('Daten von Zeitmesser'!$2:$100)),ROW($A$1))))","v":""},{"$f":"IF(ROW('Daten von Zeitmesser'!$1:$1)>COUNTIF('Daten von Zeitmesser'!$A:$A,418),0,INDEX('Daten von Zeitmesser'!B:B,SMALL(IF('Daten von Zeitmesser'!$A$2:$A$100=418,ROW('Daten von Zeitmesser'!$2:$100)),ROW($A$1))))","v":0},{"$f":"IF(ROW('Daten von Zeitmesser'!$1:$1)>COUNTIF('Daten von Zeitmesser'!$A:$A,418),0,INDEX('Daten von Zeitmesser'!C:C,SMALL(IF('Daten von Zeitmesser'!$A$2:$A$100=418,ROW('Daten von Zeitmesser'!$2:$100)),ROW($A$1))))","v":0},{"$f":"IF(ROW('Daten von Zeitmesser'!$1:$1)>COUNTIF('Daten von Zeitmesser'!$A:$A,418),\"171\",INDEX('Daten von Zeitmesser'!D:D,SMALL(IF('Daten von Zeitmesser'!$A$2:$A$100=418,ROW('Daten von Zeitmesser'!$2:$100)),ROW($A$1))))","v":"171"}]
[{"$f":"IF(ROW('Daten von Zeitmesser'!$1:$1)>COUNTIF('Daten von Zeitmesser'!$A:$A,119),\"\",INDEX('Daten von Zeitmesser'!A:A,SMALL(IF('Daten von Zeitmesser'!$A$2:$A$100=119,ROW('Daten von Zeitmesser'!$2:$100)),ROW($A$1))))","v":""},{"$f":"IF(ROW('Daten von Zeitmesser'!$1:$1)>COUNTIF('Daten von Zeitmesser'!$A:$A,119),0,INDEX('Daten von Zeitmesser'!B:B,SMALL(IF('Daten von Zeitmesser'!$A$2:$A$100=119,ROW('Daten von Zeitmesser'!$2:$100)),ROW($A$1))))","v":0},{"$f":"IF(ROW('Daten von Zeitmesser'!$1:$1)>COUNTIF('Daten von Zeitmesser'!$A:$A,119),0,INDEX('Daten von Zeitmesser'!C:C,SMALL(IF('Daten von Zeitmesser'!$A$2:$A$100=119,ROW('Daten von Zeitmesser'!$2:$100)),ROW($A$1))))","v":0},{"$f":"IF(ROW('Daten von Zeitmesser'!$1:$1)>COUNTIF('Daten von Zeitmesser'!$A:$A,119),\"172\",INDEX('Daten von Zeitmesser'!D:D,SMALL(IF('Daten von Zeitmesser'!$A$2:$A$100=119,ROW('Daten von Zeitmesser'!$2:$100)),ROW($A$1))))","v":"172"}]
[{"$f":"IF(ROW('Daten von Zeitmesser'!$1:$1)>COUNTIF('Daten von Zeitmesser'!$A:$A,219),\"\",INDEX('Daten von Zeitmesser'!A:A,SMALL(IF('Daten von Zeitmesser'!$A$2:$A$100=219,ROW('Daten von Zeitmesser'!$2:$100)),ROW($A$1))))","v":""},{"$f":"IF(ROW('Daten von Zeitmesser'!$1:$1)>COUNTIF('Daten von Zeitmesser'!$A:$A,219),0,INDEX('Daten von Zeitmesser'!B:B,SMALL(IF('Daten von Zeitmesser'!$A$2:$A$100=219,ROW('Daten von Zeitmesser'!$2:$100)),ROW($A$1))))","v":0},{"$f":"IF(ROW('Daten von Zeitmesser'!$1:$1)>COUNTIF('Daten von Zeitmesser'!$A:$A,219),0,INDEX('Daten von Zeitmesser'!C:C,SMALL(IF('Daten von Zeitmesser'!$A$2:$A$100=219,ROW('Daten von Zeitmesser'!$2:$100)),ROW($A$1))))","v":0},{"$f":"IF(ROW('Daten von Zeitmesser'!$1:$1)>COUNTIF('Daten von Zeitmesser'!$A:$A,219),\"173\",INDEX('Daten von Zeitmesser'!D:D,SMALL(IF('Daten von Zeitmesser'!$A$2:$A$100=219,ROW('Daten von Zeitmesser'!$2:$100)),ROW($A$1))))","v":"173"}]
[{"$f":"IF(ROW('Daten von Zeitmesser'!$1:$1)>COUNTIF('Daten von Zeitmesser'!$A:$A,319),\"\",INDEX('Daten von Zeitmesser'!A:A,SMALL(IF('Daten von Zeitmesser'!$A$2:$A$100=319,ROW('Daten von Zeitmesser'!$2:$100)),ROW($A$1))))","v":""},{"$f":"IF(ROW('Daten von Zeitmesser'!$1:$1)>COUNTIF('Daten von Zeitmesser'!$A:$A,319),0,INDEX('Daten von Zeitmesser'!B:B,SMALL(IF('Daten von Zeitmesser'!$A$2:$A$100=319,ROW('Daten von Zeitmesser'!$2:$100)),ROW($A$1))))","v":0},{"$f":"IF(ROW('Daten von Zeitmesser'!$1:$1)>COUNTIF('Daten von Zeitmesser'!$A:$A,319),0,INDEX('Daten von Zeitmesser'!C:C,SMALL(IF('Daten von Zeitmesser'!$A$2:$A$100=319,ROW('Daten von Zeitmesser'!$2:$100)),ROW($A$1))))","v":0},{"$f":"IF(ROW('Daten von Zeitmesser'!$1:$1)>COUNTIF('Daten von Zeitmesser'!$A:$A,319),\"174\",INDEX('Daten von Zeitmesser'!D:D,SMALL(IF('Daten von Zeitmesser'!$A$2:$A$100=319,ROW('Daten von Zeitmesser'!$2:$100)),ROW($A$1))))","v":"174"}]
[{"$f":"IF(ROW('Daten von Zeitmesser'!$1:$1)>COUNTIF('Daten von Zeitmesser'!$A:$A,419),\"\",INDEX('Daten von Zeitmesser'!A:A,SMALL(IF('Daten von Zeitmesser'!$A$2:$A$100=419,ROW('Daten von Zeitmesser'!$2:$100)),ROW($A$1))))","v":""},{"$f":"IF(ROW('Daten von Zeitmesser'!$1:$1)>COUNTIF('Daten von Zeitmesser'!$A:$A,419),0,INDEX('Daten von Zeitmesser'!B:B,SMALL(IF('Daten von Zeitmesser'!$A$2:$A$100=419,ROW('Daten von Zeitmesser'!$2:$100)),ROW($A$1))))","v":0},{"$f":"IF(ROW('Daten von Zeitmesser'!$1:$1)>COUNTIF('Daten von Zeitmesser'!$A:$A,419),0,INDEX('Daten von Zeitmesser'!C:C,SMALL(IF('Daten von Zeitmesser'!$A$2:$A$100=419,ROW('Daten von Zeitmesser'!$2:$100)),ROW($A$1))))","v":0},{"$f":"IF(ROW('Daten von Zeitmesser'!$1:$1)>COUNTIF('Daten von Zeitmesser'!$A:$A,419),\"175\",INDEX('Daten von Zeitmesser'!D:D,SMALL(IF('Daten von Zeitmesser'!$A$2:$A$100=419,ROW('Daten von Zeitmesser'!$2:$100)),ROW($A$1))))","v":"175"}]
[{"$f":"IF(ROW('Daten von Zeitmesser'!$1:$1)>COUNTIF('Daten von Zeitmesser'!$A:$A,120),\"\",INDEX('Daten von Zeitmesser'!A:A,SMALL(IF('Daten von Zeitmesser'!$A$2:$A$100=120,ROW('Daten von Zeitmesser'!$2:$100)),ROW($A$1))))","v":""},{"$f":"IF(ROW('Daten von Zeitmesser'!$1:$1)>COUNTIF('Daten von Zeitmesser'!$A:$A,120),0,INDEX('Daten von Zeitmesser'!B:B,SMALL(IF('Daten von Zeitmesser'!$A$2:$A$100=120,ROW('Daten von Zeitmesser'!$2:$100)),ROW($A$1))))","v":0},{"$f":"IF(ROW('Daten von Zeitmesser'!$1:$1)>COUNTIF('Daten von Zeitmesser'!$A:$A,120),0,INDEX('Daten von Zeitmesser'!C:C,SMALL(IF('Daten von Zeitmesser'!$A$2:$A$100=120,ROW('Daten von Zeitmesser'!$2:$100)),ROW($A$1))))","v":0},{"$f":"IF(ROW('Daten von Zeitmesser'!$1:$1)>COUNTIF('Daten von Zeitmesser'!$A:$A,120),\"176\",INDEX('Daten von Zeitmesser'!D:D,SMALL(IF('Daten von Zeitmesser'!$A$2:$A$100=120,ROW('Daten von Zeitmesser'!$2:$100)),ROW($A$1))))","v":"176"}]
[{"$f":"IF(ROW('Daten von Zeitmesser'!$1:$1)>COUNTIF('Daten von Zeitmesser'!$A:$A,220),\"\",INDEX('Daten von Zeitmesser'!A:A,SMALL(IF('Daten von Zeitmesser'!$A$2:$A$100=220,ROW('Daten von Zeitmesser'!$2:$100)),ROW($A$1))))","v":""},{"$f":"IF(ROW('Daten von Zeitmesser'!$1:$1)>COUNTIF('Daten von Zeitmesser'!$A:$A,220),0,INDEX('Daten von Zeitmesser'!B:B,SMALL(IF('Daten von Zeitmesser'!$A$2:$A$100=220,ROW('Daten von Zeitmesser'!$2:$100)),ROW($A$1))))","v":0},{"$f":"IF(ROW('Daten von Zeitmesser'!$1:$1)>COUNTIF('Daten von Zeitmesser'!$A:$A,220),0,INDEX('Daten von Zeitmesser'!C:C,SMALL(IF('Daten von Zeitmesser'!$A$2:$A$100=220,ROW('Daten von Zeitmesser'!$2:$100)),ROW($A$1))))","v":0},{"$f":"IF(ROW('Daten von Zeitmesser'!$1:$1)>COUNTIF('Daten von Zeitmesser'!$A:$A,220),\"177\",INDEX('Daten von Zeitmesser'!D:D,SMALL(IF('Daten von Zeitmesser'!$A$2:$A$100=220,ROW('Daten von Zeitmesser'!$2:$100)),ROW($A$1))))","v":"177"}]
[{"$f":"IF(ROW('Daten von Zeitmesser'!$1:$1)>COUNTIF('Daten von Zeitmesser'!$A:$A,320),\"\",INDEX('Daten von Zeitmesser'!A:A,SMALL(IF('Daten von Zeitmesser'!$A$2:$A$100=320,ROW('Daten von Zeitmesser'!$2:$100)),ROW($A$1))))","v":""},{"$f":"IF(ROW('Daten von Zeitmesser'!$1:$1)>COUNTIF('Daten von Zeitmesser'!$A:$A,320),0,INDEX('Daten von Zeitmesser'!B:B,SMALL(IF('Daten von Zeitmesser'!$A$2:$A$100=320,ROW('Daten von Zeitmesser'!$2:$100)),ROW($A$1))))","v":0},{"$f":"IF(ROW('Daten von Zeitmesser'!$1:$1)>COUNTIF('Daten von Zeitmesser'!$A:$A,320),0,INDEX('Daten von Zeitmesser'!C:C,SMALL(IF('Daten von Zeitmesser'!$A$2:$A$100=320,ROW('Daten von Zeitmesser'!$2:$100)),ROW($A$1))))","v":0},{"$f":"IF(ROW('Daten von Zeitmesser'!$1:$1)>COUNTIF('Daten von Zeitmesser'!$A:$A,320),\"178\",INDEX('Daten von Zeitmesser'!D:D,SMALL(IF('Daten von Zeitmesser'!$A$2:$A$100=320,ROW('Daten von Zeitmesser'!$2:$100)),ROW($A$1))))","v":"178"}]
[{"$f":"IF(ROW('Daten von Zeitmesser'!$1:$1)>COUNTIF('Daten von Zeitmesser'!$A:$A,420),\"\",INDEX('Daten von Zeitmesser'!A:A,SMALL(IF('Daten von Zeitmesser'!$A$2:$A$100=420,ROW('Daten von Zeitmesser'!$2:$100)),ROW($A$1))))","v":""},{"$f":"IF(ROW('Daten von Zeitmesser'!$1:$1)>COUNTIF('Daten von Zeitmesser'!$A:$A,420),0,INDEX('Daten von Zeitmesser'!B:B,SMALL(IF('Daten von Zeitmesser'!$A$2:$A$100=420,ROW('Daten von Zeitmesser'!$2:$100)),ROW($A$1))))","v":0},{"$f":"IF(ROW('Daten von Zeitmesser'!$1:$1)>COUNTIF('Daten von Zeitmesser'!$A:$A,420),0,INDEX('Daten von Zeitmesser'!C:C,SMALL(IF('Daten von Zeitmesser'!$A$2:$A$100=420,ROW('Daten von Zeitmesser'!$2:$100)),ROW($A$1))))","v":0},{"$f":"IF(ROW('Daten von Zeitmesser'!$1:$1)>COUNTIF('Daten von Zeitmesser'!$A:$A,420),\"179\",INDEX('Daten von Zeitmesser'!D:D,SMALL(IF('Daten von Zeitmesser'!$A$2:$A$100=420,ROW('Daten von Zeitmesser'!$2:$100)),ROW($A$1))))","v":"179"}]

{"sheet":"Pruefung","index":2,"n_rows":164,"n_cols":20,"rows_kept":164,"cut":false,"hidden":false,"merged":[[69,14,69,15],[5,6,5,8],[5,14,5,15],[37,6,37,8],[37,14,37,15],[45,6,45,8],[45,14,45,15],[13,6,13,8],[13,14,13,15],[21,6,21,8],[21,14,21,15],[29,6,29,8],[29,14,29,15],[0,0,0,15],[1,0,1,15],[2,0,2,15],[3,0,3,15],[125,6,125,8],[125,14,125,15],[101,6,101,8],[101,14,101,15],[109,6,109,8],[109,14,109,15],[117,6,117,8],[117,14,117,15],[77,6,77,8],[77,14,77,15],[85,6,85,8],[85,14,85,15],[2,18,5,18],[149,6,149,8],[149,14,149,15],[157,6,157,8],[157,14,157,15],[133,6,133,8],[133,14,133,15],[141,6,141,8],[141,14,141,15],[93,6,93,8],[93,14,93,15],[53,6,53,8],[53,14,53,15],[61,6,61,8],[61,14,61,15],[69,6,69,8]]}
[{"$f":"Grunddaten!B2","v":"Pferdesporttage"}]
[{"$f":"Grunddaten!B4","v":"OKV Vereins-Cup"}]
[{"$f":"Grunddaten!B6","v":"Preis der…"}]
[{"$f":"Grunddaten!B8","v":"Dieses Dokument wurde erstellt von David Stadelmann - 076 561 41 21"}]
[]
[1,"Equipe:",{"$f":"Grunddaten!D12","v":"100"},null,null,null,"Normalparcours",null,null,null,null,null,null,null,"Stechen"]
[null,null,"Reiter","Pferd",null,null,"Fehler",null,"Zeit",null,null,null,null,null,"Fehler","Zeit"]
[null,{"$f":"Grunddaten!A12","v":""},{"$f":"IF(Grunddaten!B12>0,Grunddaten!B12,\"NICHTSTARTER\")","v":"NICHTSTARTER"},{"$f":"IF(Grunddaten!C12>0,Grunddaten!C12,\"NICHTSTARTER\")","v":"NICHTSTARTER"},{"$f":"IF(M8=N8,\"x\",\"\")","v":""},{"$f":"IF(G8=K8,\"x\",\"\")","v":"x"},0,{"$f":"IF(E8=\"\",G8,\"0\")","v":0},0,{"$f":"IF(E8=\"\",I8,\"0\")","v":0},{"$f":"LARGE(G8:G11,1)","v":0},{"$f":"IF(F8=\"\",\"0\",I8)","v":0},{"$f":"L8+0.001","v":1E-3},{"$f":"LARGE(M8:M11,1)","v":4.0000000000000001E-3},0,0,{"$f":"IF(I8>0,1,0)","v":0},null,{"$f":"IF(G8<999,G8,999)","v":0},{"$f":"IF(G8<999,I8,999)","v":0}]
[null,{"$f":"Grunddaten!A13","v":""},{"$f":"IF(Grunddaten!B13>0,Grunddaten!B13,\"NICHTSTARTER\")","v":"NICHTSTARTER"},{"$f":"IF(Grunddaten!C13>0,Grunddaten!C13,\"NICHTSTARTER\")","v":"NICHTSTARTER"},{"$f":"IF(M9=N8,\"x\",\"\")","v":""},{"$f":"IF(G9=K8,\"x\",\"\")","v":"x"},0,{"$f":"IF(E9=\"\",G9,\"0\")","v":0},0,{"$f":"IF(E9=\"\",I9,\"0\")","v":0},null,{"$f":"IF(F9=\"\",\"0\",I9)","v":0},{"$f":"L9+0.002","v":2E-3},null,0,0,{"$f":"IF(I9>0,1,0)","v":0},null,{"$f":"IF(G9<999,G9,999)","v":0},{"$f":"IF(G9<999,I9,999)","v":0}]
[null,{"$f":"Grunddaten!A14","v":""},{"$f":"IF(Grunddaten!B14>0,Grunddaten!B14,\"NICHTSTARTER\")","v":"NICHTSTARTER"},{"$f":"IF(Grunddaten!C14>0,Grunddaten!C14,\"NICHTSTARTER\")","v":"NICHTSTARTER"},{"$f":"IF(M10=N8,\"x\",\"\")","v":""},{"$f":"IF(G10=K8,\"x\",\"\")","v":"x"},0,{"$f":"IF(E10=\"\",G10,\"0\")","v":0},0,{"$f":"IF(E10=\"\",I10,\"0\")","v":0},null,{"$f":"IF(F10=\"\",\"0\",I10)","v":0},{"$f":"L10+0.003","v":3.0000000000000001E-3},null,0,0,{"$f":"IF(I10>0,1,0)","v":0},null,0,0]
[null,{"$f":"Grunddaten!A15","v":""},{"$f":"IF(Grunddaten!B15>0,Grunddaten!B15,\"NICHTSTARTER\")","v":"NICHTSTARTER"},{"$f":"IF(Grunddaten!C15>0,Grunddaten!C15,\"NICHTSTARTER\")","v":"NICHTSTARTER"},{"$f":"IF(M11=N8,\"x\",\"\")","v":"x"},{"$f":"IF(G11=K8,\"x\",\"\")","v":"x"},0,{"$f":"IF(E11=\"\",G11,\"0\")","v":"0"},0,{"$f":"IF(E11=\"\",I11,\"0\")","v":"0"},null,{"$f":"IF(F11=\"\",\"0\",I11)","v":0},{"$f":"L11+0.004","v":4.0000000000000001E-3},null,0,0,{"$f":"IF(I11>0,1,0)","v":0},null,0,0]
[null,null,null,null,null,null,{"$f":"H8+H9+H10+H11","v":0},null,{"$f":"J8+J9+J10+J11","v":0},null,null,null,null,null,{"$f":"O8+O9+O10+O11","v":0},{"$f":"P8+P9+P10+P11","v":0},{"$f":"SUM(Q8:Q11)","v":0},null,{"$f":"IF(G12<999,SUM(S8:S11),999)","v":0},{"$f":"IF(G12<999,SUM(T8:T11),999)","v":0}]
[]
[2,"Equipe:",{"$f":"Grunddaten!D16","v":"104"},null,null,null,"Normalparcours",null,null,null,null,null,null,null,"Stechen"]
[null,null,"Reiter","Pferd",null,null,"Fehler",null,"Zeit",null,null,null,null,null,"Fehler","Zeit"]
[null,{"$f":"Grunddaten!A16","v":""},{"$f":"IF(Grunddaten!B16>0,Grunddaten!B16,\"NICHTSTARTER\")","v":"NICHTSTARTER"},{"$f":"IF(Grunddaten!C16>0,Grunddaten!C16,\"NICHTSTARTER\")","v":"NICHTSTARTER"},{"$f":"IF(M16=N16,\"x\",\"\")","v":""},{"$f":"IF(G16=K16,\"x\",\"\")","v":"x"},0,{"$f":"IF(E16=\"\",G16,\"0\")","v":0},0,{"$f":"IF(E16=\"\",I16,\"0\")","v":0},{"$f":"LARGE(G16:G19,1)","v":0},{"$f":"IF(F16=\"\",\"0\",I16)","v":0},{"$f":"L16+0.001","v":1E-3},{"$f":"LARGE(M16:M19,1)","v":4.0000000000000001E-3},0,0,{"$f":"IF(I16>0,1,0)","v":0},null,{"$f":"IF(G16<999,G16,999)","v":0},{"$f":"IF(G16<999,I16,999)","v":0}]
[null,{"$f":"Grunddaten!A17","v":""},{"$f":"IF(Grunddaten!B17>0,Grunddaten!B17,\"NICHTSTARTER\")","v":"NICHTSTARTER"},{"$f":"IF(Grunddaten!C17>0,Grunddaten!C17,\"NICHTSTARTER\")","v":"NICHTSTARTER"},{"$f":"IF(M17=N16,\"x\",\"\")","v":""},{"$f":"IF(G17=K16,\"x\",\"\")","v":"x"},0,{"$f":"IF(E17=\"\",G17,\"0\")","v":0},0,{"$f":"IF(E17=\"\",I17,\"0\")","v":0},null,{"$f":"IF(F17=\"\",\"0\",I17)","v":0},{"$f":"L17+0.002","v":2E-3},null,0,0,{"$f":"IF(I17>0,1,0)","v":0},null,{"$f":"IF(G17<999,G17,999)","v":0},{"$f":"IF(G17<999,I17,999)","v":0}]
[null,{"$f":"Grunddaten!A18","v":""},{"$f":"IF(Grunddaten!B18>0,Grunddaten!B18,\"NICHTSTARTER\")","v":"NICHTSTARTER"},{"$f":"IF(Grunddaten!C18>0,Grunddaten!C18,\"NICHTSTARTER\")","v":"NICHTSTARTER"},{"$f":"IF(M18=N16,\"x\",\"\")","v":""},{"$f":"IF(G18=K16,\"x\",\"\")","v":"x"},0,{"$f":"IF(E18=\"\",G18,\"0\")","v":0},0,{"$f":"IF(E18=\"\",I18,\"0\")","v":0},null,{"$f":"IF(F18=\"\",\"0\",I18)","v":0},{"$f":"L18+0.003","v":3.0000000000000001E-3},null,0,0,{"$f":"IF(I18>0,1,0)","v":0},null,0,0]
[null,{"$f":"Grunddaten!A19","v":""},{"$f":"IF(Grunddaten!B19>0,Grunddaten!B19,\"NICHTSTARTER\")","v":"NICHTSTARTER"},{"$f":"IF(Grunddaten!C19>0,Grunddaten!C19,\"NICHTSTARTER\")","v":"NICHTSTARTER"},{"$f":"IF(M19=N16,\"x\",\"\")","v":"x"},{"$f":"IF(G19=K16,\"x\",\"\")","v":"x"},0,{"$f":"IF(E19=\"\",G19,\"0\")","v":"0"},0,{"$f":"IF(E19=\"\",I19,\"0\")","v":"0"},null,{"$f":"IF(F19=\"\",\"0\",I19)","v":0},{"$f":"L19+0.004","v":4.0000000000000001E-3},null,0,0,{"$f":"IF(I19>0,1,0)","v":0},null,0,0]
[null,null,null,null,null,null,{"$f":"H16+H17+H18+H19","v":0},null,{"$f":"J16+J17+J18+J19","v":0},null,null,null,null,null,{"$f":"O16+O17+O18+O19","v":0},{"$f":"P16+P17+P18+P19","v":0},{"$f":"SUM(Q16:Q19)","v":0},null,{"$f":"IF(G20<999,SUM(S16:S19),999)","v":0},{"$f":"IF(G20<999,SUM(T16:T19),999)","v":0}]
[]
[3,"Equipe:",{"$f":"Grunddaten!D20","v":"108"},null,null,null,"Normalparcours",null,null,null,null,null,null,null,"Stechen"]
[null,null,"Reiter","Pferd",null,null,"Fehler",null,"Zeit",null,null,null,null,null,"Fehler","Zeit"]
[null,{"$f":"Grunddaten!A20","v":""},{"$f":"IF(Grunddaten!B20>0,Grunddaten!B20,\"NICHTSTARTER\")","v":"NICHTSTARTER"},{"$f":"IF(Grunddaten!C20>0,Grunddaten!C20,\"NICHTSTARTER\")","v":"NICHTSTARTER"},{"$f":"IF(M24=N24,\"x\",\"\")","v":""},{"$f":"IF(G24=K24,\"x\",\"\")","v":"x"},0,{"$f":"IF(E24=\"\",G24,\"0\")","v":0},0,{"$f":"IF(E24=\"\",I24,\"0\")","v":0},{"$f":"LARGE(G24:G27,1)","v":0},{"$f":"IF(F24=\"\",\"0\",I24)","v":0},{"$f":"L24+0.001","v":1E-3},{"$f":"LARGE(M24:M27,1)","v":4.0000000000000001E-3},0,0,{"$f":"IF(I24>0,1,0)","v":0},null,{"$f":"IF(G24<999,G24,999)","v":0},{"$f":"IF(G24<999,I24,999)","v":0}]
[null,{"$f":"Grunddaten!A21","v":""},{"$f":"IF(Grunddaten!B21>0,Grunddaten!B21,\"NICHTSTARTER\")","v":"NICHTSTARTER"},{"$f":"IF(Grunddaten!C21>0,Grunddaten!C21,\"NICHTSTARTER\")","v":"NICHTSTARTER"},{"$f":"IF(M25=N24,\"x\",\"\")","v":""},{"$f":"IF(G25=K24,\"x\",\"\")","v":"x"},0,{"$f":"IF(E25=\"\",G25,\"0\")","v":0},0,{"$f":"IF(E25=\"\",I25,\"0\")","v":0},null,{"$f":"IF(F25=\"\",\"0\",I25)","v":0},{"$f":"L25+0.002","v":2E-3},null,0,0,{"$f":"IF(I25>0,1,0)","v":0},null,{"$f":"IF(G25<999,G25,999)","v":0},{"$f":"IF(G25<999,I25,999)","v":0}]
[null,{"$f":"Grunddaten!A22","v":""},{"$f":"IF(Grunddaten!B22>0,Grunddaten!B22,\"NICHTSTARTER\")","v":"NICHTSTARTER"},{"$f":"IF(Grunddaten!C22>0,Grunddaten!C22,\"NICHTSTARTER\")","v":"NICHTSTARTER"},{"$f":"IF(M26=N24,\"x\",\"\")","v":""},{"$f":"IF(G26=K24,\"x\",\"\")","v":"x"},0,{"$f":"IF(E26=\"\",G26,\"0\")","v":0},0,{"$f":"IF(E26=\"\",I26,\"0\")","v":0},null,{"$f":"IF(F26=\"\",\"0\",I26)","v":0},{"$f":"L26+0.003","v":3.0000000000000001E-3},null,0,0,{"$f":"IF(I26>0,1,0)","v":0},null,0,0]
[null,{"$f":"Grunddaten!A23","v":""},{"$f":"IF(Grunddaten!B23>0,Grunddaten!B23,\"NICHTSTARTER\")","v":"NICHTSTARTER"},{"$f":"IF(Grunddaten!C23>0,Grunddaten!C23,\"NICHTSTARTER\")","v":"NICHTSTARTER"},{"$f":"IF(M27=N24,\"x\",\"\")","v":"x"},{"$f":"IF(G27=K24,\"x\",\"\")","v":"x"},0,{"$f":"IF(E27=\"\",G27,\"0\")","v":"0"},0,{"$f":"IF(E27=\"\",I27,\"0\")","v":"0"},null,{"$f":"IF(F27=\"\",\"0\",I27)","v":0},{"$f":"L27+0.004","v":4.0000000000000001E-3},null,0,0,{"$f":"IF(I27>0,1,0)","v":0},null,0,0]
[null,null,null,null,null,null,{"$f":"H24+H25+H26+H27","v":0},null,{"$f":"J24+J25+J26+J27","v":0},null,null,null,null,null,{"$f":"O24+O25+O26+O27","v":0},{"$f":"P24+P25+P26+P27","v":0},{"$f":"SUM(Q24:Q27)","v":0},null,{"$f":"IF(G28<999,SUM(S24:S27),999)","v":0},{"$f":"IF(G28<999,SUM(T24:T27),999)","v":0}]
[]
[4,"Equipe:",{"$f":"Grunddaten!D24","v":"112"},null,null,null,"Normalparcours",null,null,null,null,null,null,null,"Stechen"]
[null,null,"Reiter","Pferd",null,null,"Fehler",null,"Zeit",null,null,null,null,null,"Fehler","Zeit"]
[null,{"$f":"Grunddaten!A24","v":""},{"$f":"IF(Grunddaten!B24>0,Grunddaten!B24,\"NICHTSTARTER\")","v":"NICHTSTARTER"},{"$f":"IF(Grunddaten!C24>0,Grunddaten!C24,\"NICHTSTARTER\")","v":"NICHTSTARTER"},{"$f":"IF(M32=N32,\"x\",\"\")","v":""},{"$f":"IF(G32=K32,\"x\",\"\")","v":"x"},0,{"$f":"IF(E32=\"\",G32,\"0\")","v":0},0,{"$f":"IF(E32=\"\",I32,\"0\")","v":0},{"$f":"LARGE(G32:G35,1)","v":0},{"$f":"IF(F32=\"\",\"0\",I32)","v":0},{"$f":"L32+0.001","v":1E-3},{"$f":"LARGE(M32:M35,1)","v":4.0000000000000001E-3},0,0,{"$f":"IF(I32>0,1,0)","v":0},null,{"$f":"IF(G32<999,G32,999)","v":0},{"$f":"IF(G32<999,I32,999)","v":0}]
[null,{"$f":"Grunddaten!A25","v":""},{"$f":"IF(Grunddaten!B25>0,Grunddaten!B25,\"NICHTSTARTER\")","v":"NICHTSTARTER"},{"$f":"IF(Grunddaten!C25>0,Grunddaten!C25,\"NICHTSTARTER\")","v":"NICHTSTARTER"},{"$f":"IF(M33=N32,\"x\",\"\")","v":""},{"$f":"IF(G33=K32,\"x\",\"\")","v":"x"},0,{"$f":"IF(E33=\"\",G33,\"0\")","v":0},0,{"$f":"IF(E33=\"\",I33,\"0\")","v":0},null,{"$f":"IF(F33=\"\",\"0\",I33)","v":0},{"$f":"L33+0.002","v":2E-3},null,0,0,{"$f":"IF(I33>0,1,0)","v":0},null,{"$f":"IF(G33<999,G33,999)","v":0},{"$f":"IF(G33<999,I33,999)","v":0}]
[null,{"$f":"Grunddaten!A26","v":""},{"$f":"IF(Grunddaten!B26>0,Grunddaten!B26,\"NICHTSTARTER\")","v":"NICHTSTARTER"},{"$f":"IF(Grunddaten!C26>0,Grunddaten!C26,\"NICHTSTARTER\")","v":"NICHTSTARTER"},{"$f":"IF(M34=N32,\"x\",\"\")","v":""},{"$f":"IF(G34=K32,\"x\",\"\")","v":"x"},0,{"$f":"IF(E34=\"\",G34,\"0\")","v":0},0,{"$f":"IF(E34=\"\",I34,\"0\")","v":0},null,{"$f":"IF(F34=\"\",\"0\",I34)","v":0},{"$f":"L34+0.003","v":3.0000000000000001E-3},null,0,0,{"$f":"IF(I34>0,1,0)","v":0},null,0,0]
[null,{"$f":"Grunddaten!A27","v":""},{"$f":"IF(Grunddaten!B27>0,Grunddaten!B27,\"NICHTSTARTER\")","v":"NICHTSTARTER"},{"$f":"IF(Grunddaten!C27>0,Grunddaten!C27,\"NICHTSTARTER\")","v":"NICHTSTARTER"},{"$f":"IF(M35=N32,\"x\",\"\")","v":"x"},{"$f":"IF(G35=K32,\"x\",\"\")","v":"x"},0,{"$f":"IF(E35=\"\",G35,\"0\")","v":"0"},0,{"$f":"IF(E35=\"\",I35,\"0\")","v":"0"},null,{"$f":"IF(F35=\"\",\"0\",I35)","v":0},{"$f":"L35+0.004","v":4.0000000000000001E-3},null,0,0,{"$f":"IF(I35>0,1,0)","v":0},null,0,0]
[null,null,null,null,null,null,{"$f":"H32+H33+H34+H35","v":0},null,{"$f":"J32+J33+J34+J35","v":0},null,null,null,null,null,{"$f":"O32+O33+O34+O35","v":0},{"$f":"P32+P33+P34+P35","v":0},{"$f":"SUM(Q32:Q35)","v":0},null,{"$f":"IF(G36<999,SUM(S32:S35),999)","v":0},{"$f":"IF(G36<999,SUM(T32:T35),999)","v":0}]
[]
[5,"Equipe:",{"$f":"Grunddaten!D28","v":"116"},null,null,null,"Normalparcours",null,null,null,null,null,null,null,"Stechen"]
[null,null,"Reiter","Pferd",null,null,"Fehler",null,"Zeit",null,null,null,null,null,"Fehler","Zeit"]
[null,{"$f":"Grunddaten!A28","v":""},{"$f":"IF(Grunddaten!B28>0,Grunddaten!B28,\"NICHTSTARTER\")","v":"NICHTSTARTER"},{"$f":"IF(Grunddaten!C28>0,Grunddaten!C28,\"NICHTSTARTER\")","v":"NICHTSTARTER"},{"$f":"IF(M40=N40,\"x\",\"\")","v":""},{"$f":"IF(G40=K40,\"x\",\"\")","v":"x"},0,{"$f":"IF(E40=\"\",G40,\"0\")","v":0},0,{"$f":"IF(E40=\"\",I40,\"0\")","v":0},{"$f":"LARGE(G40:G43,1)","v":0},{"$f":"IF(F40=\"\",\"0\",I40)","v":0},{"$f":"L40+0.001","v":1E-3},{"$f":"LARGE(M40:M43,1)","v":4.0000000000000001E-3},0,0,{"$f":"IF(I40>0,1,0)","v":0},null,{"$f":"IF(G40<999,G40,999)","v":0},{"$f":"IF(G40<999,I40,999)","v":0}]
[null,{"$f":"Grunddaten!A29","v":""},{"$f":"IF(Grunddaten!B29>0,Grunddaten!B29,\"NICHTSTARTER\")","v":"NICHTSTARTER"},{"$f":"IF(Grunddaten!C29>0,Grunddaten!C29,\"NICHTSTARTER\")","v":"NICHTSTARTER"},{"$f":"IF(M41=N40,\"x\",\"\")","v":""},{"$f":"IF(G41=K40,\"x\",\"\")","v":"x"},0,{"$f":"IF(E41=\"\",G41,\"0\")","v":0},0,{"$f":"IF(E41=\"\",I41,\"0\")","v":0},null,{"$f":"IF(F41=\"\",\"0\",I41)","v":0},{"$f":"L41+0.002","v":2E-3},null,0,0,{"$f":"IF(I41>0,1,0)","v":0},null,{"$f":"IF(G41<999,G41,999)","v":0},{"$f":"IF(G41<999,I41,999)","v":0}]
[null,{"$f":"Grunddaten!A30","v":""},{"$f":"IF(Grunddaten!B30>0,Grunddaten!B30,\"NICHTSTARTER\")","v":"NICHTSTARTER"},{"$f":"IF(Grunddaten!C30>0,Grunddaten!C30,\"NICHTSTARTER\")","v":"NICHTSTARTER"},{"$f":"IF(M42=N40,\"x\",\"\")","v":""},{"$f":"IF(G42=K40,\"x\",\"\")","v":"x"},0,{"$f":"IF(E42=\"\",G42,\"0\")","v":0},0,{"$f":"IF(E42=\"\",I42,\"0\")","v":0},null,{"$f":"IF(F42=\"\",\"0\",I42)","v":0},{"$f":"L42+0.003","v":3.0000000000000001E-3},null,0,0,{"$f":"IF(I42>0,1,0)","v":0},null,0,0]
[null,{"$f":"Grunddaten!A31","v":""},{"$f":"IF(Grunddaten!B31>0,Grunddaten!B31,\"NICHTSTARTER\")","v":"NICHTSTARTER"},{"$f":"IF(Grunddaten!C31>0,Grunddaten!C31,\"NICHTSTARTER\")","v":"NICHTSTARTER"},{"$f":"IF(M43=N40,\"x\",\"\")","v":"x"},{"$f":"IF(G43=K40,\"x\",\"\")","v":"x"},0,{"$f":"IF(E43=\"\",G43,\"0\")","v":"0"},0,{"$f":"IF(E43=\"\",I43,\"0\")","v":"0"},null,{"$f":"IF(F43=\"\",\"0\",I43)","v":0},{"$f":"L43+0.004","v":4.0000000000000001E-3},null,0,0,{"$f":"IF(I43>0,1,0)","v":0},null,0,0]
[null,null,null,null,null,null,{"$f":"H40+H41+H42+H43","v":0},null,{"$f":"J40+J41+J42+J43","v":0},null,null,null,null,null,{"$f":"O40+O41+O42+O43","v":0},{"$f":"P40+P41+P42+P43","v":0},{"$f":"SUM(Q40:Q43)","v":0},null,{"$f":"IF(G44<999,SUM(S40:S43),999)","v":0},{"$f":"IF(G44<999,SUM(T40:T43),999)","v":0}]
[]
[6,"Equipe:",{"$f":"Grunddaten!D32","v":"120"},null,null,null,"Normalparcours",null,null,null,null,null,null,null,"Stechen"]
[null,null,"Reiter","Pferd",null,null,"Fehler",null,"Zeit",null,null,null,null,null,"Fehler","Zeit"]
[null,{"$f":"Grunddaten!A32","v":""},{"$f":"IF(Grunddaten!B32>0,Grunddaten!B32,\"NICHTSTARTER\")","v":"NICHTSTARTER"},{"$f":"IF(Grunddaten!C32>0,Grunddaten!C32,\"NICHTSTARTER\")","v":"NICHTSTARTER"},{"$f":"IF(M48=N48,\"x\",\"\")","v":""},{"$f":"IF(G48=K48,\"x\",\"\")","v":"x"},0,{"$f":"IF(E48=\"\",G48,\"0\")","v":0},0,{"$f":"IF(E48=\"\",I48,\"0\")","v":0},{"$f":"LARGE(G48:G51,1)","v":0},{"$f":"IF(F48=\"\",\"0\",I48)","v":0},{"$f":"L48+0.001","v":1E-3},{"$f":"LARGE(M48:M51,1)","v":4.0000000000000001E-3},0,0,{"$f":"IF(I48>0,1,0)","v":0},null,{"$f":"IF(G48<999,G48,999)","v":0},{"$f":"IF(G48<999,I48,999)","v":0}]
[null,{"$f":"Grunddaten!A33","v":""},{"$f":"IF(Grunddaten!B33>0,Grunddaten!B33,\"NICHTSTARTER\")","v":"NICHTSTARTER"},{"$f":"IF(Grunddaten!C33>0,Grunddaten!C33,\"NICHTSTARTER\")","v":"NICHTSTARTER"},{"$f":"IF(M49=N48,\"x\",\"\")","v":""},{"$f":"IF(G49=K48,\"x\",\"\")","v":"x"},0,{"$f":"IF(E49=\"\",G49,\"0\")","v":0},0,{"$f":"IF(E49=\"\",I49,\"0\")","v":0},null,{"$f":"IF(F49=\"\",\"0\",I49)","v":0},{"$f":"L49+0.002","v":2E-3},null,0,0,{"$f":"IF(I49>0,1,0)","v":0},null,{"$f":"IF(G49<999,G49,999)","v":0},{"$f":"IF(G49<999,I49,999)","v":0}]
[null,{"$f":"Grunddaten!A34","v":""},{"$f":"IF(Grunddaten!B34>0,Grunddaten!B34,\"NICHTSTARTER\")","v":"NICHTSTARTER"},{"$f":"IF(Grunddaten!C34>0,Grunddaten!C34,\"NICHTSTARTER\")","v":"NICHTSTARTER"},{"$f":"IF(M50=N48,\"x\",\"\")","v":""},{"$f":"IF(G50=K48,\"x\",\"\")","v":"x"},0,{"$f":"IF(E50=\"\",G50,\"0\")","v":0},0,{"$f":"IF(E50=\"\",I50,\"0\")","v":0},null,{"$f":"IF(F50=\"\",\"0\",I50)","v":0},{"$f":"L50+0.003","v":3.0000000000000001E-3},null,0,0,{"$f":"IF(I50>0,1,0)","v":0},null,0,0]
[null,{"$f":"Grunddaten!A35","v":""},{"$f":"IF(Grunddaten!B35>0,Grunddaten!B35,\"NICHTSTARTER\")","v":"NICHTSTARTER"},{"$f":"IF(Grunddaten!C35>0,Grunddaten!C35,\"NICHTSTARTER\")","v":"NICHTSTARTER"},{"$f":"IF(M51=N48,\"x\",\"\")","v":"x"},{"$f":"IF(G51=K48,\"x\",\"\")","v":"x"},0,{"$f":"IF(E51=\"\",G51,\"0\")","v":"0"},0,{"$f":"IF(E51=\"\",I51,\"0\")","v":"0"},null,{"$f":"IF(F51=\"\",\"0\",I51)","v":0},{"$f":"L51+0.004","v":4.0000000000000001E-3},null,0,0,{"$f":"IF(I51>0,1,0)","v":0},null,0,0]
[null,null,null,null,null,null,{"$f":"H48+H49+H50+H51","v":0},null,{"$f":"J48+J49+J50+J51","v":0},null,null,null,null,null,{"$f":"O48+O49+O50+O51","v":0},{"$f":"P48+P49+P50+P51","v":0},{"$f":"SUM(Q48:Q51)","v":0},null,{"$f":"IF(G52<999,SUM(S48:S51),999)","v":0},{"$f":"IF(G52<999,SUM(T48:T51),999)","v":0}]
[]
[7,"Equipe:",{"$f":"Grunddaten!D36","v":"124"},null,null,null,"Normalparcours",null,null,null,null,null,null,null,"Stechen"]
[null,null,"Reiter","Pferd",null,null,"Fehler",null,"Zeit",null,null,null,null,null,"Fehler","Zeit"]
[null,{"$f":"Grunddaten!A36","v":""},{"$f":"IF(Grunddaten!B36>0,Grunddaten!B36,\"NICHTSTARTER\")","v":"NICHTSTARTER"},{"$f":"IF(Grunddaten!C36>0,Grunddaten!C36,\"NICHTSTARTER\")","v":"NICHTSTARTER"},{"$f":"IF(M56=N56,\"x\",\"\")","v":""},{"$f":"IF(G56=K56,\"x\",\"\")","v":"x"},0,{"$f":"IF(E56=\"\",G56,\"0\")","v":0},0,{"$f":"IF(E56=\"\",I56,\"0\")","v":0},{"$f":"LARGE(G56:G59,1)","v":0},{"$f":"IF(F56=\"\",\"0\",I56)","v":0},{"$f":"L56+0.001","v":1E-3},{"$f":"LARGE(M56:M59,1)","v":4.0000000000000001E-3},0,0,{"$f":"IF(I56>0,1,0)","v":0},null,{"$f":"IF(G56<999,G56,999)","v":0},{"$f":"IF(G56<999,I56,999)","v":0}]
[null,{"$f":"Grunddaten!A37","v":""},{"$f":"IF(Grunddaten!B37>0,Grunddaten!B37,\"NICHTSTARTER\")","v":"NICHTSTARTER"},{"$f":"IF(Grunddaten!C37>0,Grunddaten!C37,\"NICHTSTARTER\")","v":"NICHTSTARTER"},{"$f":"IF(M57=N56,\"x\",\"\")","v":""},{"$f":"IF(G57=K56,\"x\",\"\")","v":"x"},0,{"$f":"IF(E57=\"\",G57,\"0\")","v":0},0,{"$f":"IF(E57=\"\",I57,\"0\")","v":0},null,{"$f":"IF(F57=\"\",\"0\",I57)","v":0},{"$f":"L57+0.002","v":2E-3},null,0,0,{"$f":"IF(I57>0,1,0)","v":0},null,{"$f":"IF(G57<999,G57,999)","v":0},{"$f":"IF(G57<999,I57,999)","v":0}]
[null,{"$f":"Grunddaten!A38","v":""},{"$f":"IF(Grunddaten!B38>0,Grunddaten!B38,\"NICHTSTARTER\")","v":"NICHTSTARTER"},{"$f":"IF(Grunddaten!C38>0,Grunddaten!C38,\"NICHTSTARTER\")","v":"NICHTSTARTER"},{"$f":"IF(M58=N56,\"x\",\"\")","v":""},{"$f":"IF(G58=K56,\"x\",\"\")","v":"x"},0,{"$f":"IF(E58=\"\",G58,\"0\")","v":0},0,{"$f":"IF(E58=\"\",I58,\"0\")","v":0},null,{"$f":"IF(F58=\"\",\"0\",I58)","v":0},{"$f":"L58+0.003","v":3.0000000000000001E-3},null,0,0,{"$f":"IF(I58>0,1,0)","v":0},null,0,0]
[null,{"$f":"Grunddaten!A39","v":""},{"$f":"IF(Grunddaten!B39>0,Grunddaten!B39,\"NICHTSTARTER\")","v":"NICHTSTARTER"},{"$f":"IF(Grunddaten!C39>0,Grunddaten!C39,\"NICHTSTARTER\")","v":"NICHTSTARTER"},{"$f":"IF(M59=N56,\"x\",\"\")","v":"x"},{"$f":"IF(G59=K56,\"x\",\"\")","v":"x"},0,{"$f":"IF(E59=\"\",G59,\"0\")","v":"0"},0,{"$f":"IF(E59=\"\",I59,\"0\")","v":"0"},null,{"$f":"IF(F59=\"\",\"0\",I59)","v":0},{"$f":"L59+0.004","v":4.0000000000000001E-3},null,0,0,{"$f":"IF(I59>0,1,0)","v":0},null,0,0]
[null,null,null,null,null,null,{"$f":"H56+H57+H58+H59","v":0},null,{"$f":"J56+J57+J58+J59","v":0},null,null,null,null,null,{"$f":"O56+O57+O58+O59","v":0},{"$f":"P56+P57+P58+P59","v":0},{"$f":"SUM(Q56:Q59)","v":0},null,{"$f":"IF(G60<999,SUM(S56:S59),999)","v":0},{"$f":"IF(G60<999,SUM(T56:T59),999)","v":0}]
[]
[8,"Equipe:",{"$f":"Grunddaten!D40","v":"128"},null,null,null,"Normalparcours",null,null,null,null,null,null,null,"Stechen"]
[null,null,"Reiter","Pferd",null,null,"Fehler",null,"Zeit",null,null,null,null,null,"Fehler","Zeit"]
[null,{"$f":"Grunddaten!A40","v":""},{"$f":"IF(Grunddaten!B40>0,Grunddaten!B40,\"NICHTSTARTER\")","v":"NICHTSTARTER"},{"$f":"IF(Grunddaten!C40>0,Grunddaten!C40,\"NICHTSTARTER\")","v":"NICHTSTARTER"},{"$f":"IF(M64=N64,\"x\",\"\")","v":""},{"$f":"IF(G64=K64,\"x\",\"\")","v":"x"},0,{"$f":"IF(E64=\"\",G64,\"0\")","v":0},0,{"$f":"IF(E64=\"\",I64,\"0\")","v":0},{"$f":"LARGE(G64:G67,1)","v":0},{"$f":"IF(F64=\"\",\"0\",I64)","v":0},{"$f":"L64+0.001","v":1E-3},{"$f":"LARGE(M64:M67,1)","v":4.0000000000000001E-3},0,0,{"$f":"IF(I64>0,1,0)","v":0},null,{"$f":"IF(G64<999,G64,999)","v":0},{"$f":"IF(G64<999,I64,999)","v":0}]
[null,{"$f":"Grunddaten!A41","v":""},{"$f":"IF(Grunddaten!B41>0,Grunddaten!B41,\"NICHTSTARTER\")","v":"NICHTSTARTER"},{"$f":"IF(Grunddaten!C41>0,Grunddaten!C41,\"NICHTSTARTER\")","v":"NICHTSTARTER"},{"$f":"IF(M65=N64,\"x\",\"\")","v":""},{"$f":"IF(G65=K64,\"x\",\"\")","v":"x"},0,{"$f":"IF(E65=\"\",G65,\"0\")","v":0},0,{"$f":"IF(E65=\"\",I65,\"0\")","v":0},null,{"$f":"IF(F65=\"\",\"0\",I65)","v":0},{"$f":"L65+0.002","v":2E-3},null,0,0,{"$f":"IF(I65>0,1,0)","v":0},null,{"$f":"IF(G65<999,G65,999)","v":0},{"$f":"IF(G65<999,I65,999)","v":0}]
[null,{"$f":"Grunddaten!A42","v":""},{"$f":"IF(Grunddaten!B42>0,Grunddaten!B42,\"NICHTSTARTER\")","v":"NICHTSTARTER"},{"$f":"IF(Grunddaten!C42>0,Grunddaten!C42,\"NICHTSTARTER\")","v":"NICHTSTARTER"},{"$f":"IF(M66=N64,\"x\",\"\")","v":""},{"$f":"IF(G66=K64,\"x\",\"\")","v":"x"},0,{"$f":"IF(E66=\"\",G66,\"0\")","v":0},0,{"$f":"IF(E66=\"\",I66,\"0\")","v":0},null,{"$f":"IF(F66=\"\",\"0\",I66)","v":0},{"$f":"L66+0.003","v":3.0000000000000001E-3},null,0,0,{"$f":"IF(I66>0,1,0)","v":0},null,0,0]
[null,{"$f":"Grunddaten!A43","v":""},{"$f":"IF(Grunddaten!B43>0,Grunddaten!B43,\"NICHTSTARTER\")","v":"NICHTSTARTER"},{"$f":"IF(Grunddaten!C43>0,Grunddaten!C43,\"NICHTSTARTER\")","v":"NICHTSTARTER"},{"$f":"IF(M67=N64,\"x\",\"\")","v":"x"},{"$f":"IF(G67=K64,\"x\",\"\")","v":"x"},0,{"$f":"IF(E67=\"\",G67,\"0\")","v":"0"},0,{"$f":"IF(E67=\"\",I67,\"0\")","v":"0"},null,{"$f":"IF(F67=\"\",\"0\",I67)","v":0},{"$f":"L67+0.004","v":4.0000000000000001E-3},null,0,0,{"$f":"IF(I67>0,1,0)","v":0},null,0,0]
[null,null,null,null,null,null,{"$f":"H64+H65+H66+H67","v":0},null,{"$f":"J64+J65+J66+J67","v":0},null,null,null,null,null,{"$f":"O64+O65+O66+O67","v":0},{"$f":"P64+P65+P66+P67","v":0},{"$f":"SUM(Q64:Q67)","v":0},null,{"$f":"IF(G68<999,SUM(S64:S67),999)","v":0},{"$f":"IF(G68<999,SUM(T64:T67),999)","v":0}]
[]
[9,"Equipe:",{"$f":"Grunddaten!D44","v":"132"},null,null,null,"Normalparcours",null,null,null,null,null,null,null,"Stechen"]
[null,null,"Reiter","Pferd",null,null,"Fehler",null,"Zeit",null,null,null,null,null,"Fehler","Zeit"]
[null,{"$f":"Grunddaten!A44","v":""},{"$f":"IF(Grunddaten!B44>0,Grunddaten!B44,\"NICHTSTARTER\")","v":"NICHTSTARTER"},{"$f":"IF(Grunddaten!C44>0,Grunddaten!C44,\"NICHTSTARTER\")","v":"NICHTSTARTER"},{"$f":"IF(M72=N72,\"x\",\"\")","v":""},{"$f":"IF(G72=K72,\"x\",\"\")","v":"x"},0,{"$f":"IF(E72=\"\",G72,\"0\")","v":0},0,{"$f":"IF(E72=\"\",I72,\"0\")","v":0},{"$f":"LARGE(G72:G75,1)","v":0},{"$f":"IF(F72=\"\",\"0\",I72)","v":0},{"$f":"L72+0.001","v":1E-3},{"$f":"LARGE(M72:M75,1)","v":4.0000000000000001E-3},0,0,{"$f":"IF(I72>0,1,0)","v":0},null,{"$f":"IF(G72<999,G72,999)","v":0},{"$f":"IF(G72<999,I72,999)","v":0}]
[null,{"$f":"Grunddaten!A45","v":""},{"$f":"IF(Grunddaten!B45>0,Grunddaten!B45,\"NICHTSTARTER\")","v":"NICHTSTARTER"},{"$f":"IF(Grunddaten!C45>0,Grunddaten!C45,\"NICHTSTARTER\")","v":"NICHTSTARTER"},{"$f":"IF(M73=N72,\"x\",\"\")","v":""},{"$f":"IF(G73=K72,\"x\",\"\")","v":"x"},0,{"$f":"IF(E73=\"\",G73,\"0\")","v":0},0,{"$f":"IF(E73=\"\",I73,\"0\")","v":0},null,{"$f":"IF(F73=\"\",\"0\",I73)","v":0},{"$f":"L73+0.002","v":2E-3},null,0,0,{"$f":"IF(I73>0,1,0)","v":0},null,{"$f":"IF(G73<999,G73,999)","v":0},{"$f":"IF(G73<999,I73,999)","v":0}]
[null,{"$f":"Grunddaten!A46","v":""},{"$f":"IF(Grunddaten!B46>0,Grunddaten!B46,\"NICHTSTARTER\")","v":"NICHTSTARTER"},{"$f":"IF(Grunddaten!C46>0,Grunddaten!C46,\"NICHTSTARTER\")","v":"NICHTSTARTER"},{"$f":"IF(M74=N72,\"x\",\"\")","v":""},{"$f":"IF(G74=K72,\"x\",\"\")","v":"x"},0,{"$f":"IF(E74=\"\",G74,\"0\")","v":0},0,{"$f":"IF(E74=\"\",I74,\"0\")","v":0},null,{"$f":"IF(F74=\"\",\"0\",I74)","v":0},{"$f":"L74+0.003","v":3.0000000000000001E-3},null,0,0,{"$f":"IF(I74>0,1,0)","v":0},null,0,0]
[null,{"$f":"Grunddaten!A47","v":""},{"$f":"IF(Grunddaten!B47>0,Grunddaten!B47,\"NICHTSTARTER\")","v":"NICHTSTARTER"},{"$f":"IF(Grunddaten!C47>0,Grunddaten!C47,\"NICHTSTARTER\")","v":"NICHTSTARTER"},{"$f":"IF(M75=N72,\"x\",\"\")","v":"x"},{"$f":"IF(G75=K72,\"x\",\"\")","v":"x"},0,{"$f":"IF(E75=\"\",G75,\"0\")","v":"0"},0,{"$f":"IF(E75=\"\",I75,\"0\")","v":"0"},null,{"$f":"IF(F75=\"\",\"0\",I75)","v":0},{"$f":"L75+0.004","v":4.0000000000000001E-3},null,0,0,{"$f":"IF(I75>0,1,0)","v":0},null,0,0]
[null,null,null,null,null,null,{"$f":"H72+H73+H74+H75","v":0},null,{"$f":"J72+J73+J74+J75","v":0},null,null,null,null,null,{"$f":"O72+O73+O74+O75","v":0},{"$f":"P72+P73+P74+P75","v":0},{"$f":"SUM(Q72:Q75)","v":0},null,{"$f":"IF(G76<999,SUM(S72:S75),999)","v":0},{"$f":"IF(G76<999,SUM(T72:T75),999)","v":0}]
[]
[10,"Equipe:",{"$f":"Grunddaten!D48","v":"136"},null,null,null,"Normalparcours",null,null,null,null,null,null,null,"Stechen"]
[null,null,"Reiter","Pferd",null,null,"Fehler",null,"Zeit",null,null,null,null,null,"Fehler","Zeit"]
[null,{"$f":"Grunddaten!A48","v":""},{"$f":"IF(Grunddaten!B48>0,Grunddaten!B48,\"NICHTSTARTER\")","v":"NICHTSTARTER"},{"$f":"IF(Grunddaten!C48>0,Grunddaten!C48,\"NICHTSTARTER\")","v":"NICHTSTARTER"},{"$f":"IF(M80=N80,\"x\",\"\")","v":""},{"$f":"IF(G80=K80,\"x\",\"\")","v":"x"},0,{"$f":"IF(E80=\"\",G80,\"0\")","v":0},0,{"$f":"IF(E80=\"\",I80,\"0\")","v":0},{"$f":"LARGE(G80:G83,1)","v":0},{"$f":"IF(F80=\"\",\"0\",I80)","v":0},{"$f":"L80+0.001","v":1E-3},{"$f":"LARGE(M80:M83,1)","v":4.0000000000000001E-3},0,0,{"$f":"IF(I80>0,1,0)","v":0},null,{"$f":"IF(G80<999,G80,999)","v":0},{"$f":"IF(G80<999,I80,999)","v":0}]
[null,{"$f":"Grunddaten!A49","v":""},{"$f":"IF(Grunddaten!B49>0,Grunddaten!B49,\"NICHTSTARTER\")","v":"NICHTSTARTER"},{"$f":"IF(Grunddaten!C49>0,Grunddaten!C49,\"NICHTSTARTER\")","v":"NICHTSTARTER"},{"$f":"IF(M81=N80,\"x\",\"\")","v":""},{"$f":"IF(G81=K80,\"x\",\"\")","v":"x"},0,{"$f":"IF(E81=\"\",G81,\"0\")","v":0},0,{"$f":"IF(E81=\"\",I81,\"0\")","v":0},null,{"$f":"IF(F81=\"\",\"0\",I81)","v":0},{"$f":"L81+0.002","v":2E-3},null,0,0,{"$f":"IF(I81>0,1,0)","v":0},null,{"$f":"IF(G81<999,G81,999)","v":0},{"$f":"IF(G81<999,I81,999)","v":0}]
[null,{"$f":"Grunddaten!A50","v":""},{"$f":"IF(Grunddaten!B50>0,Grunddaten!B50,\"NICHTSTARTER\")","v":"NICHTSTARTER"},{"$f":"IF(Grunddaten!C50>0,Grunddaten!C50,\"NICHTSTARTER\")","v":"NICHTSTARTER"},{"$f":"IF(M82=N80,\"x\",\"\")","v":""},{"$f":"IF(G82=K80,\"x\",\"\")","v":"x"},0,{"$f":"IF(E82=\"\",G82,\"0\")","v":0},0,{"$f":"IF(E82=\"\",I82,\"0\")","v":0},null,{"$f":"IF(F82=\"\",\"0\",I82)","v":0},{"$f":"L82+0.003","v":3.0000000000000001E-3},null,0,0,{"$f":"IF(I82>0,1,0)","v":0},null,0,0]
[null,{"$f":"Grunddaten!A51","v":""},{"$f":"IF(Grunddaten!B51>0,Grunddaten!B51,\"NICHTSTARTER\")","v":"NICHTSTARTER"},{"$f":"IF(Grunddaten!C51>0,Grunddaten!C51,\"NICHTSTARTER\")","v":"NICHTSTARTER"},{"$f":"IF(M83=N80,\"x\",\"\")","v":"x"},{"$f":"IF(G83=K80,\"x\",\"\")","v":"x"},0,{"$f":"IF(E83=\"\",G83,\"0\")","v":"0"},0,{"$f":"IF(E83=\"\",I83,\"0\")","v":"0"},null,{"$f":"IF(F83=\"\",\"0\",I83)","v":0},{"$f":"L83+0.004","v":4.0000000000000001E-3},null,0,0,{"$f":"IF(I83>0,1,0)","v":0},null,0,0]
[null,null,null,null,null,null,{"$f":"H80+H81+H82+H83","v":0},null,{"$f":"J80+J81+J82+J83","v":0},null,null,null,null,null,{"$f":"O80+O81+O82+O83","v":0},{"$f":"P80+P81+P82+P83","v":0},{"$f":"SUM(Q80:Q83)","v":0},null,{"$f":"IF(G84<999,SUM(S80:S83),999)","v":0},{"$f":"IF(G84<999,SUM(T80:T83),999)","v":0}]
[]
[11,"Equipe:",{"$f":"Grunddaten!D52","v":"140"},null,null,null,"Normalparcours",null,null,null,null,null,null,null,"Stechen"]
[null,null,"Reiter","Pferd",null,null,"Fehler",null,"Zeit",null,null,null,null,null,"Fehler","Zeit"]
[null,{"$f":"Grunddaten!A52","v":""},{"$f":"IF(Grunddaten!B52>0,Grunddaten!B52,\"NICHTSTARTER\")","v":"NICHTSTARTER"},{"$f":"IF(Grunddaten!C52>0,Grunddaten!C52,\"NICHTSTARTER\")","v":"NICHTSTARTER"},{"$f":"IF(M88=N88,\"x\",\"\")","v":""},{"$f":"IF(G88=K88,\"x\",\"\")","v":"x"},0,{"$f":"IF(E88=\"\",G88,\"0\")","v":0},0,{"$f":"IF(E88=\"\",I88,\"0\")","v":0},{"$f":"LARGE(G88:G91,1)","v":0},{"$f":"IF(F88=\"\",\"0\",I88)","v":0},{"$f":"L88+0.001","v":1E-3},{"$f":"LARGE(M88:M91,1)","v":4.0000000000000001E-3},0,0,{"$f":"IF(I88>0,1,0)","v":0},null,{"$f":"IF(G88<999,G88,999)","v":0},{"$f":"IF(G88<999,I88,999)","v":0}]
[null,{"$f":"Grunddaten!A53","v":""},{"$f":"IF(Grunddaten!B53>0,Grunddaten!B53,\"NICHTSTARTER\")","v":"NICHTSTARTER"},{"$f":"IF(Grunddaten!C53>0,Grunddaten!C53,\"NICHTSTARTER\")","v":"NICHTSTARTER"},{"$f":"IF(M89=N88,\"x\",\"\")","v":""},{"$f":"IF(G89=K88,\"x\",\"\")","v":"x"},0,{"$f":"IF(E89=\"\",G89,\"0\")","v":0},0,{"$f":"IF(E89=\"\",I89,\"0\")","v":0},null,{"$f":"IF(F89=\"\",\"0\",I89)","v":0},{"$f":"L89+0.002","v":2E-3},null,0,0,{"$f":"IF(I89>0,1,0)","v":0},null,{"$f":"IF(G89<999,G89,999)","v":0},{"$f":"IF(G89<999,I89,999)","v":0}]
[null,{"$f":"Grunddaten!A54","v":""},{"$f":"IF(Grunddaten!B54>0,Grunddaten!B54,\"NICHTSTARTER\")","v":"NICHTSTARTER"},{"$f":"IF(Grunddaten!C54>0,Grunddaten!C54,\"NICHTSTARTER\")","v":"NICHTSTARTER"},{"$f":"IF(M90=N88,\"x\",\"\")","v":""},{"$f":"IF(G90=K88,\"x\",\"\")","v":"x"},0,{"$f":"IF(E90=\"\",G90,\"0\")","v":0},0,{"$f":"IF(E90=\"\",I90,\"0\")","v":0},null,{"$f":"IF(F90=\"\",\"0\",I90)","v":0},{"$f":"L90+0.003","v":3.0000000000000001E-3},null,0,0,{"$f":"IF(I90>0,1,0)","v":0},null,0,0]
[null,{"$f":"Grunddaten!A55","v":""},{"$f":"IF(Grunddaten!B55>0,Grunddaten!B55,\"NICHTSTARTER\")","v":"NICHTSTARTER"},{"$f":"IF(Grunddaten!C55>0,Grunddaten!C55,\"NICHTSTARTER\")","v":"NICHTSTARTER"},{"$f":"IF(M91=N88,\"x\",\"\")","v":"x"},{"$f":"IF(G91=K88,\"x\",\"\")","v":"x"},0,{"$f":"IF(E91=\"\",G91,\"0\")","v":"0"},0,{"$f":"IF(E91=\"\",I91,\"0\")","v":"0"},null,{"$f":"IF(F91=\"\",\"0\",I91)","v":0},{"$f":"L91+0.004","v":4.0000000000000001E-3},null,0,0,{"$f":"IF(I91>0,1,0)","v":0},null,0,0]
[null,null,null,null,null,null,{"$f":"H88+H89+H90+H91","v":0},null,{"$f":"J88+J89+J90+J91","v":0},null,null,null,null,null,{"$f":"O88+O89+O90+O91","v":0},{"$f":"P88+P89+P90+P91","v":0},{"$f":"SUM(Q88:Q91)","v":0},null,{"$f":"IF(G92<999,SUM(S88:S91),999)","v":0},{"$f":"IF(G92<999,SUM(T88:T91),999)","v":0}]
[]
[12,"Equipe:",{"$f":"Grunddaten!D56","v":"144"},null,null,null,"Normalparcours",null,null,null,null,null,null,null,"Stechen"]
[null,null,"Reiter","Pferd",null,null,"Fehler",null,"Zeit",null,null,null,null,null,"Fehler","Zeit"]
[null,{"$f":"Grunddaten!A56","v":""},{"$f":"IF(Grunddaten!B56>0,Grunddaten!B56,\"NICHTSTARTER\")","v":"NICHTSTARTER"},{"$f":"IF(Grunddaten!C56>0,Grunddaten!C56,\"NICHTSTARTER\")","v":"NICHTSTARTER"},{"$f":"IF(M96=N96,\"x\",\"\")","v":""},{"$f":"IF(G96=K96,\"x\",\"\")","v":"x"},0,{"$f":"IF(E96=\"\",G96,\"0\")","v":0},0,{"$f":"IF(E96=\"\",I96,\"0\")","v":0},{"$f":"LARGE(G96:G99,1)","v":0},{"$f":"IF(F96=\"\",\"0\",I96)","v":0},{"$f":"L96+0.001","v":1E-3},{"$f":"LARGE(M96:M99,1)","v":4.0000000000000001E-3},0,0,{"$f":"IF(I96>0,1,0)","v":0},null,{"$f":"IF(G96<999,G96,999)","v":0},{"$f":"IF(G96<999,I96,999)","v":0}]
[null,{"$f":"Grunddaten!A57","v":""},{"$f":"IF(Grunddaten!B57>0,Grunddaten!B57,\"NICHTSTARTER\")","v":"NICHTSTARTER"},{"$f":"IF(Grunddaten!C57>0,Grunddaten!C57,\"NICHTSTARTER\")","v":"NICHTSTARTER"},{"$f":"IF(M97=N96,\"x\",\"\")","v":""},{"$f":"IF(G97=K96,\"x\",\"\")","v":"x"},0,{"$f":"IF(E97=\"\",G97,\"0\")","v":0},0,{"$f":"IF(E97=\"\",I97,\"0\")","v":0},null,{"$f":"IF(F97=\"\",\"0\",I97)","v":0},{"$f":"L97+0.002","v":2E-3},null,0,0,{"$f":"IF(I97>0,1,0)","v":0},null,{"$f":"IF(G97<999,G97,999)","v":0},{"$f":"IF(G97<999,I97,999)","v":0}]
[null,{"$f":"Grunddaten!A58","v":""},{"$f":"IF(Grunddaten!B58>0,Grunddaten!B58,\"NICHTSTARTER\")","v":"NICHTSTARTER"},{"$f":"IF(Grunddaten!C58>0,Grunddaten!C58,\"NICHTSTARTER\")","v":"NICHTSTARTER"},{"$f":"IF(M98=N96,\"x\",\"\")","v":""},{"$f":"IF(G98=K96,\"x\",\"\")","v":"x"},0,{"$f":"IF(E98=\"\",G98,\"0\")","v":0},0,{"$f":"IF(E98=\"\",I98,\"0\")","v":0},null,{"$f":"IF(F98=\"\",\"0\",I98)","v":0},{"$f":"L98+0.003","v":3.0000000000000001E-3},null,0,0,{"$f":"IF(I98>0,1,0)","v":0},null,0,0]
[null,{"$f":"Grunddaten!A59","v":""},{"$f":"IF(Grunddaten!B59>0,Grunddaten!B59,\"NICHTSTARTER\")","v":"NICHTSTARTER"},{"$f":"IF(Grunddaten!C59>0,Grunddaten!C59,\"NICHTSTARTER\")","v":"NICHTSTARTER"},{"$f":"IF(M99=N96,\"x\",\"\")","v":"x"},{"$f":"IF(G99=K96,\"x\",\"\")","v":"x"},0,{"$f":"IF(E99=\"\",G99,\"0\")","v":"0"},0,{"$f":"IF(E99=\"\",I99,\"0\")","v":"0"},null,{"$f":"IF(F99=\"\",\"0\",I99)","v":0},{"$f":"L99+0.004","v":4.0000000000000001E-3},null,0,0,{"$f":"IF(I99>0,1,0)","v":0},null,0,0]
[null,null,null,null,null,null,{"$f":"H96+H97+H98+H99","v":0},null,{"$f":"J96+J97+J98+J99","v":0},null,null,null,null,null,{"$f":"O96+O97+O98+O99","v":0},{"$f":"P96+P97+P98+P99","v":0},{"$f":"SUM(Q96:Q99)","v":0},null,{"$f":"IF(G100<999,SUM(S96:S99),999)","v":0},{"$f":"IF(G100<999,SUM(T96:T99),999)","v":0}]
[]
[13,"Equipe:",{"$f":"Grunddaten!D60","v":"148"},null,null,null,"Normalparcours",null,null,null,null,null,null,null,"Stechen"]
[null,null,"Reiter","Pferd",null,null,"Fehler",null,"Zeit",null,null,null,null,null,"Fehler","Zeit"]
[null,{"$f":"Grunddaten!A60","v":""},{"$f":"IF(Grunddaten!B60>0,Grunddaten!B60,\"NICHTSTARTER\")","v":"NICHTSTARTER"},{"$f":"IF(Grunddaten!C60>0,Grunddaten!C60,\"NICHTSTARTER\")","v":"NICHTSTARTER"},{"$f":"IF(M104=N104,\"x\",\"\")","v":""},{"$f":"IF(G104=K104,\"x\",\"\")","v":"x"},0,{"$f":"IF(E104=\"\",G104,\"0\")","v":0},0,{"$f":"IF(E104=\"\",I104,\"0\")","v":0},{"$f":"LARGE(G104:G107,1)","v":0},{"$f":"IF(F104=\"\",\"0\",I104)","v":0},{"$f":"L104+0.001","v":1E-3},{"$f":"LARGE(M104:M107,1)","v":4.0000000000000001E-3},0,0,{"$f":"IF(I104>0,1,0)","v":0},null,{"$f":"IF(G104<999,G104,999)","v":0},{"$f":"IF(G104<999,I104,999)","v":0}]
[null,{"$f":"Grunddaten!A61","v":""},{"$f":"IF(Grunddaten!B61>0,Grunddaten!B61,\"NICHTSTARTER\")","v":"NICHTSTARTER"},{"$f":"IF(Grunddaten!C61>0,Grunddaten!C61,\"NICHTSTARTER\")","v":"NICHTSTARTER"},{"$f":"IF(M105=N104,\"x\",\"\")","v":""},{"$f":"IF(G105=K104,\"x\",\"\")","v":"x"},0,{"$f":"IF(E105=\"\",G105,\"0\")","v":0},0,{"$f":"IF(E105=\"\",I105,\"0\")","v":0},null,{"$f":"IF(F105=\"\",\"0\",I105)","v":0},{"$f":"L105+0.002","v":2E-3},null,0,0,{"$f":"IF(I105>0,1,0)","v":0},null,{"$f":"IF(G105<999,G105,999)","v":0},{"$f":"IF(G105<999,I105,999)","v":0}]
[null,{"$f":"Grunddaten!A62","v":""},{"$f":"IF(Grunddaten!B62>0,Grunddaten!B62,\"NICHTSTARTER\")","v":"NICHTSTARTER"},{"$f":"IF(Grunddaten!C62>0,Grunddaten!C62,\"NICHTSTARTER\")","v":"NICHTSTARTER"},{"$f":"IF(M106=N104,\"x\",\"\")","v":""},{"$f":"IF(G106=K104,\"x\",\"\")","v":"x"},0,{"$f":"IF(E106=\"\",G106,\"0\")","v":0},0,{"$f":"IF(E106=\"\",I106,\"0\")","v":0},null,{"$f":"IF(F106=\"\",\"0\",I106)","v":0},{"$f":"L106+0.003","v":3.0000000000000001E-3},null,0,0,{"$f":"IF(I106>0,1,0)","v":0},null,0,0]
[null,{"$f":"Grunddaten!A63","v":""},{"$f":"IF(Grunddaten!B63>0,Grunddaten!B63,\"NICHTSTARTER\")","v":"NICHTSTARTER"},{"$f":"IF(Grunddaten!C63>0,Grunddaten!C63,\"NICHTSTARTER\")","v":"NICHTSTARTER"},{"$f":"IF(M107=N104,\"x\",\"\")","v":"x"},{"$f":"IF(G107=K104,\"x\",\"\")","v":"x"},0,{"$f":"IF(E107=\"\",G107,\"0\")","v":"0"},0,{"$f":"IF(E107=\"\",I107,\"0\")","v":"0"},null,{"$f":"IF(F107=\"\",\"0\",I107)","v":0},{"$f":"L107+0.004","v":4.0000000000000001E-3},null,0,0,{"$f":"IF(I107>0,1,0)","v":0},null,0,0]
[null,null,null,null,null,null,{"$f":"H104+H105+H106+H107","v":0},null,{"$f":"J104+J105+J106+J107","v":0},null,null,null,null,null,{"$f":"O104+O105+O106+O107","v":0},{"$f":"P104+P105+P106+P107","v":0},{"$f":"SUM(Q104:Q107)","v":0},null,{"$f":"IF(G108<999,SUM(S104:S107),999)","v":0},{"$f":"IF(G108<999,SUM(T104:T107),999)","v":0}]
[]
[14,"Equipe:",{"$f":"Grunddaten!D64","v":"152"},null,null,null,"Normalparcours",null,null,null,null,null,null,null,"Stechen"]
[null,null,"Reiter","Pferd",null,null,"Fehler",null,"Zeit",null,null,null,null,null,"Fehler","Zeit"]
[null,{"$f":"Grunddaten!A64","v":""},{"$f":"IF(Grunddaten!B64>0,Grunddaten!B64,\"NICHTSTARTER\")","v":"NICHTSTARTER"},{"$f":"IF(Grunddaten!C64>0,Grunddaten!C64,\"NICHTSTARTER\")","v":"NICHTSTARTER"},{"$f":"IF(M112=N112,\"x\",\"\")","v":""},{"$f":"IF(G112=K112,\"x\",\"\")","v":"x"},0,{"$f":"IF(E112=\"\",G112,\"0\")","v":0},0,{"$f":"IF(E112=\"\",I112,\"0\")","v":0},{"$f":"LARGE(G112:G115,1)","v":0},{"$f":"IF(F112=\"\",\"0\",I112)","v":0},{"$f":"L112+0.001","v":1E-3},{"$f":"LARGE(M112:M115,1)","v":4.0000000000000001E-3},0,0,{"$f":"IF(I112>0,1,0)","v":0},null,{"$f":"IF(G112<999,G112,999)","v":0},{"$f":"IF(G112<999,I112,999)","v":0}]
[null,{"$f":"Grunddaten!A65","v":""},{"$f":"IF(Grunddaten!B65>0,Grunddaten!B65,\"NICHTSTARTER\")","v":"NICHTSTARTER"},{"$f":"IF(Grunddaten!C65>0,Grunddaten!C65,\"NICHTSTARTER\")","v":"NICHTSTARTER"},{"$f":"IF(M113=N112,\"x\",\"\")","v":""},{"$f":"IF(G113=K112,\"x\",\"\")","v":"x"},0,{"$f":"IF(E113=\"\",G113,\"0\")","v":0},0,{"$f":"IF(E113=\"\",I113,\"0\")","v":0},null,{"$f":"IF(F113=\"\",\"0\",I113)","v":0},{"$f":"L113+0.002","v":2E-3},null,0,0,{"$f":"IF(I113>0,1,0)","v":0},null,{"$f":"IF(G113<999,G113,999)","v":0},{"$f":"IF(G113<999,I113,999)","v":0}]
[null,{"$f":"Grunddaten!A66","v":""},{"$f":"IF(Grunddaten!B66>0,Grunddaten!B66,\"NICHTSTARTER\")","v":"NICHTSTARTER"},{"$f":"IF(Grunddaten!C66>0,Grunddaten!C66,\"NICHTSTARTER\")","v":"NICHTSTARTER"},{"$f":"IF(M114=N112,\"x\",\"\")","v":""},{"$f":"IF(G114=K112,\"x\",\"\")","v":"x"},0,{"$f":"IF(E114=\"\",G114,\"0\")","v":0},0,{"$f":"IF(E114=\"\",I114,\"0\")","v":0},null,{"$f":"IF(F114=\"\",\"0\",I114)","v":0},{"$f":"L114+0.003","v":3.0000000000000001E-3},null,0,0,{"$f":"IF(I114>0,1,0)","v":0},null,0,0]
[null,{"$f":"Grunddaten!A67","v":""},{"$f":"IF(Grunddaten!B67>0,Grunddaten!B67,\"NICHTSTARTER\")","v":"NICHTSTARTER"},{"$f":"IF(Grunddaten!C67>0,Grunddaten!C67,\"NICHTSTARTER\")","v":"NICHTSTARTER"},{"$f":"IF(M115=N112,\"x\",\"\")","v":"x"},{"$f":"IF(G115=K112,\"x\",\"\")","v":"x"},0,{"$f":"IF(E115=\"\",G115,\"0\")","v":"0"},0,{"$f":"IF(E115=\"\",I115,\"0\")","v":"0"},null,{"$f":"IF(F115=\"\",\"0\",I115)","v":0},{"$f":"L115+0.004","v":4.0000000000000001E-3},null,0,0,{"$f":"IF(I115>0,1,0)","v":0},null,0,0]
[null,null,null,null,null,null,{"$f":"H112+H113+H114+H115","v":0},null,{"$f":"J112+J113+J114+J115","v":0},null,null,null,null,null,{"$f":"O112+O113+O114+O115","v":0},{"$f":"P112+P113+P114+P115","v":0},{"$f":"SUM(Q112:Q115)","v":0},null,{"$f":"IF(G116<999,SUM(S112:S115),999)","v":0},{"$f":"IF(G116<999,SUM(T112:T115),999)","v":0}]
[]
[15,"Equipe:",{"$f":"Grunddaten!D68","v":"156"},null,null,null,"Normalparcours",null,null,null,null,null,null,null,"Stechen"]
[null,null,"Reiter","Pferd",null,null,"Fehler",null,"Zeit",null,null,null,null,null,"Fehler","Zeit"]
[null,{"$f":"Grunddaten!A68","v":""},{"$f":"IF(Grunddaten!B68>0,Grunddaten!B68,\"NICHTSTARTER\")","v":"NICHTSTARTER"},{"$f":"IF(Grunddaten!C68>0,Grunddaten!C68,\"NICHTSTARTER\")","v":"NICHTSTARTER"},{"$f":"IF(M120=N120,\"x\",\"\")","v":""},{"$f":"IF(G120=K120,\"x\",\"\")","v":"x"},0,{"$f":"IF(E120=\"\",G120,\"0\")","v":0},0,{"$f":"IF(E120=\"\",I120,\"0\")","v":0},{"$f":"LARGE(G120:G123,1)","v":0},{"$f":"IF(F120=\"\",\"0\",I120)","v":0},{"$f":"L120+0.001","v":1E-3},{"$f":"LARGE(M120:M123,1)","v":4.0000000000000001E-3},0,0,{"$f":"IF(I120>0,1,0)","v":0},null,{"$f":"IF(G120<999,G120,999)","v":0},{"$f":"IF(G120<999,I120,999)","v":0}]
[null,{"$f":"Grunddaten!A69","v":""},{"$f":"IF(Grunddaten!B69>0,Grunddaten!B69,\"NICHTSTARTER\")","v":"NICHTSTARTER"},{"$f":"IF(Grunddaten!C69>0,Grunddaten!C69,\"NICHTSTARTER\")","v":"NICHTSTARTER"},{"$f":"IF(M121=N120,\"x\",\"\")","v":""},{"$f":"IF(G121=K120,\"x\",\"\")","v":"x"},0,{"$f":"IF(E121=\"\",G121,\"0\")","v":0},0,{"$f":"IF(E121=\"\",I121,\"0\")","v":0},null,{"$f":"IF(F121=\"\",\"0\",I121)","v":0},{"$f":"L121+0.002","v":2E-3},null,0,0,{"$f":"IF(I121>0,1,0)","v":0},null,{"$f":"IF(G121<999,G121,999)","v":0},{"$f":"IF(G121<999,I121,999)","v":0}]
[null,{"$f":"Grunddaten!A70","v":""},{"$f":"IF(Grunddaten!B70>0,Grunddaten!B70,\"NICHTSTARTER\")","v":"NICHTSTARTER"},{"$f":"IF(Grunddaten!C70>0,Grunddaten!C70,\"NICHTSTARTER\")","v":"NICHTSTARTER"},{"$f":"IF(M122=N120,\"x\",\"\")","v":""},{"$f":"IF(G122=K120,\"x\",\"\")","v":"x"},0,{"$f":"IF(E122=\"\",G122,\"0\")","v":0},0,{"$f":"IF(E122=\"\",I122,\"0\")","v":0},null,{"$f":"IF(F122=\"\",\"0\",I122)","v":0},{"$f":"L122+0.003","v":3.0000000000000001E-3},null,0,0,{"$f":"IF(I122>0,1,0)","v":0},null,0,0]
[null,{"$f":"Grunddaten!A71","v":""},{"$f":"IF(Grunddaten!B71>0,Grunddaten!B71,\"NICHTSTARTER\")","v":"NICHTSTARTER"},{"$f":"IF(Grunddaten!C71>0,Grunddaten!C71,\"NICHTSTARTER\")","v":"NICHTSTARTER"},{"$f":"IF(M123=N120,\"x\",\"\")","v":"x"},{"$f":"IF(G123=K120,\"x\",\"\")","v":"x"},0,{"$f":"IF(E123=\"\",G123,\"0\")","v":"0"},0,{"$f":"IF(E123=\"\",I123,\"0\")","v":"0"},null,{"$f":"IF(F123=\"\",\"0\",I123)","v":0},{"$f":"L123+0.004","v":4.0000000000000001E-3},null,0,0,{"$f":"IF(I123>0,1,0)","v":0},null,0,0]
[null,null,null,null,null,null,{"$f":"H120+H121+H122+H123","v":0},null,{"$f":"J120+J121+J122+J123","v":0},null,null,null,null,null,{"$f":"O120+O121+O122+O123","v":0},{"$f":"P120+P121+P122+P123","v":0},{"$f":"SUM(Q120:Q123)","v":0},null,{"$f":"IF(G124<999,SUM(S120:S123),999)","v":0},{"$f":"IF(G124<999,SUM(T120:T123),999)","v":0}]
[]
[16,"Equipe:",{"$f":"Grunddaten!D72","v":"160"},null,null,null,"Normalparcours",null,null,null,null,null,null,null,"Stechen"]
[null,null,"Reiter","Pferd",null,null,"Fehler",null,"Zeit",null,null,null,null,null,"Fehler","Zeit"]
[null,{"$f":"Grunddaten!A72","v":""},{"$f":"IF(Grunddaten!B72>0,Grunddaten!B72,\"NICHTSTARTER\")","v":"NICHTSTARTER"},{"$f":"IF(Grunddaten!C72>0,Grunddaten!C72,\"NICHTSTARTER\")","v":"NICHTSTARTER"},{"$f":"IF(M128=N128,\"x\",\"\")","v":""},{"$f":"IF(G128=K128,\"x\",\"\")","v":"x"},0,{"$f":"IF(E128=\"\",G128,\"0\")","v":0},0,{"$f":"IF(E128=\"\",I128,\"0\")","v":0},{"$f":"LARGE(G128:G131,1)","v":0},{"$f":"IF(F128=\"\",\"0\",I128)","v":0},{"$f":"L128+0.001","v":1E-3},{"$f":"LARGE(M128:M131,1)","v":4.0000000000000001E-3},0,0,{"$f":"IF(I128>0,1,0)","v":0},null,{"$f":"IF(G128<999,G128,999)","v":0},{"$f":"IF(G128<999,I128,999)","v":0}]
[null,{"$f":"Grunddaten!A73","v":""},{"$f":"IF(Grunddaten!B73>0,Grunddaten!B73,\"NICHTSTARTER\")","v":"NICHTSTARTER"},{"$f":"IF(Grunddaten!C73>0,Grunddaten!C73,\"NICHTSTARTER\")","v":"NICHTSTARTER"},{"$f":"IF(M129=N128,\"x\",\"\")","v":""},{"$f":"IF(G129=K128,\"x\",\"\")","v":"x"},0,{"$f":"IF(E129=\"\",G129,\"0\")","v":0},0,{"$f":"IF(E129=\"\",I129,\"0\")","v":0},null,{"$f":"IF(F129=\"\",\"0\",I129)","v":0},{"$f":"L129+0.002","v":2E-3},null,0,0,{"$f":"IF(I129>0,1,0)","v":0},null,{"$f":"IF(G129<999,G129,999)","v":0},{"$f":"IF(G129<999,I129,999)","v":0}]
[null,{"$f":"Grunddaten!A74","v":""},{"$f":"IF(Grunddaten!B74>0,Grunddaten!B74,\"NICHTSTARTER\")","v":"NICHTSTARTER"},{"$f":"IF(Grunddaten!C74>0,Grunddaten!C74,\"NICHTSTARTER\")","v":"NICHTSTARTER"},{"$f":"IF(M130=N128,\"x\",\"\")","v":""},{"$f":"IF(G130=K128,\"x\",\"\")","v":"x"},0,{"$f":"IF(E130=\"\",G130,\"0\")","v":0},0,{"$f":"IF(E130=\"\",I130,\"0\")","v":0},null,{"$f":"IF(F130=\"\",\"0\",I130)","v":0},{"$f":"L130+0.003","v":3.0000000000000001E-3},null,0,0,{"$f":"IF(I130>0,1,0)","v":0},null,0,0]
[null,{"$f":"Grunddaten!A75","v":""},{"$f":"IF(Grunddaten!B75>0,Grunddaten!B75,\"NICHTSTARTER\")","v":"NICHTSTARTER"},{"$f":"IF(Grunddaten!C75>0,Grunddaten!C75,\"NICHTSTARTER\")","v":"NICHTSTARTER"},{"$f":"IF(M131=N128,\"x\",\"\")","v":"x"},{"$f":"IF(G131=K128,\"x\",\"\")","v":"x"},0,{"$f":"IF(E131=\"\",G131,\"0\")","v":"0"},0,{"$f":"IF(E131=\"\",I131,\"0\")","v":"0"},null,{"$f":"IF(F131=\"\",\"0\",I131)","v":0},{"$f":"L131+0.004","v":4.0000000000000001E-3},null,0,0,{"$f":"IF(I131>0,1,0)","v":0},null,0,0]
[null,null,null,null,null,null,{"$f":"H128+H129+H130+H131","v":0},null,{"$f":"J128+J129+J130+J131","v":0},null,null,null,null,null,{"$f":"O128+O129+O130+O131","v":0},{"$f":"P128+P129+P130+P131","v":0},{"$f":"SUM(Q128:Q131)","v":0},null,{"$f":"IF(G132<999,SUM(S128:S131),999)","v":0},{"$f":"IF(G132<999,SUM(T128:T131),999)","v":0}]
[]
[17,"Equipe:",{"$f":"Grunddaten!D76","v":"164"},null,null,null,"Normalparcours",null,null,null,null,null,null,null,"Stechen"]
[null,null,"Reiter","Pferd",null,null,"Fehler",null,"Zeit",null,null,null,null,null,"Fehler","Zeit"]
[null,{"$f":"Grunddaten!A76","v":""},{"$f":"IF(Grunddaten!B76>0,Grunddaten!B76,\"NICHTSTARTER\")","v":"NICHTSTARTER"},{"$f":"IF(Grunddaten!C76>0,Grunddaten!C76,\"NICHTSTARTER\")","v":"NICHTSTARTER"},{"$f":"IF(M136=N136,\"x\",\"\")","v":""},{"$f":"IF(G136=K136,\"x\",\"\")","v":"x"},0,{"$f":"IF(E136=\"\",G136,\"0\")","v":0},0,{"$f":"IF(E136=\"\",I136,\"0\")","v":0},{"$f":"LARGE(G136:G139,1)","v":0},{"$f":"IF(F136=\"\",\"0\",I136)","v":0},{"$f":"L136+0.001","v":1E-3},{"$f":"LARGE(M136:M139,1)","v":4.0000000000000001E-3},0,0,{"$f":"IF(I136>0,1,0)","v":0},null,{"$f":"IF(G136<999,G136,999)","v":0},{"$f":"IF(G136<999,I136,999)","v":0}]
[null,{"$f":"Grunddaten!A77","v":""},{"$f":"IF(Grunddaten!B77>0,Grunddaten!B77,\"NICHTSTARTER\")","v":"NICHTSTARTER"},{"$f":"IF(Grunddaten!C77>0,Grunddaten!C77,\"NICHTSTARTER\")","v":"NICHTSTARTER"},{"$f":"IF(M137=N136,\"x\",\"\")","v":""},{"$f":"IF(G137=K136,\"x\",\"\")","v":"x"},0,{"$f":"IF(E137=\"\",G137,\"0\")","v":0},0,{"$f":"IF(E137=\"\",I137,\"0\")","v":0},null,{"$f":"IF(F137=\"\",\"0\",I137)","v":0},{"$f":"L137+0.002","v":2E-3},null,0,0,{"$f":"IF(I137>0,1,0)","v":0},null,{"$f":"IF(G137<999,G137,999)","v":0},{"$f":"IF(G137<999,I137,999)","v":0}]
[null,{"$f":"Grunddaten!A78","v":""},{"$f":"IF(Grunddaten!B78>0,Grunddaten!B78,\"NICHTSTARTER\")","v":"NICHTSTARTER"},{"$f":"IF(Grunddaten!C78>0,Grunddaten!C78,\"NICHTSTARTER\")","v":"NICHTSTARTER"},{"$f":"IF(M138=N136,\"x\",\"\")","v":""},{"$f":"IF(G138=K136,\"x\",\"\")","v":"x"},0,{"$f":"IF(E138=\"\",G138,\"0\")","v":0},0,{"$f":"IF(E138=\"\",I138,\"0\")","v":0},null,{"$f":"IF(F138=\"\",\"0\",I138)","v":0},{"$f":"L138+0.003","v":3.0000000000000001E-3},null,0,0,{"$f":"IF(I138>0,1,0)","v":0},null,0,0]
[null,{"$f":"Grunddaten!A79","v":""},{"$f":"IF(Grunddaten!B79>0,Grunddaten!B79,\"NICHTSTARTER\")","v":"NICHTSTARTER"},{"$f":"IF(Grunddaten!C79>0,Grunddaten!C79,\"NICHTSTARTER\")","v":"NICHTSTARTER"},{"$f":"IF(M139=N136,\"x\",\"\")","v":"x"},{"$f":"IF(G139=K136,\"x\",\"\")","v":"x"},0,{"$f":"IF(E139=\"\",G139,\"0\")","v":"0"},0,{"$f":"IF(E139=\"\",I139,\"0\")","v":"0"},null,{"$f":"IF(F139=\"\",\"0\",I139)","v":0},{"$f":"L139+0.004","v":4.0000000000000001E-3},null,0,0,{"$f":"IF(I139>0,1,0)","v":0},null,0,0]
[null,null,null,null,null,null,{"$f":"H136+H137+H138+H139","v":0},null,{"$f":"J136+J137+J138+J139","v":0},null,null,null,null,null,{"$f":"O136+O137+O138+O139","v":0},{"$f":"P136+P137+P138+P139","v":0},{"$f":"SUM(Q136:Q139)","v":0},null,{"$f":"IF(G140<999,SUM(S136:S139),999)","v":0},{"$f":"IF(G140<999,SUM(T136:T139),999)","v":0}]
[]
[18,"Equipe:",{"$f":"Grunddaten!D80","v":"168"},null,null,null,"Normalparcours",null,null,null,null,null,null,null,"Stechen"]
[null,null,"Reiter","Pferd",null,null,"Fehler",null,"Zeit",null,null,null,null,null,"Fehler","Zeit"]
[null,{"$f":"Grunddaten!A80","v":""},{"$f":"IF(Grunddaten!B80>0,Grunddaten!B80,\"NICHTSTARTER\")","v":"NICHTSTARTER"},{"$f":"IF(Grunddaten!C80>0,Grunddaten!C80,\"NICHTSTARTER\")","v":"NICHTSTARTER"},{"$f":"IF(M144=N144,\"x\",\"\")","v":""},{"$f":"IF(G144=K144,\"x\",\"\")","v":"x"},0,{"$f":"IF(E144=\"\",G144,\"0\")","v":0},0,{"$f":"IF(E144=\"\",I144,\"0\")","v":0},{"$f":"LARGE(G144:G147,1)","v":0},{"$f":"IF(F144=\"\",\"0\",I144)","v":0},{"$f":"L144+0.001","v":1E-3},{"$f":"LARGE(M144:M147,1)","v":4.0000000000000001E-3},0,0,{"$f":"IF(I144>0,1,0)","v":0},null,{"$f":"IF(G144<999,G144,999)","v":0},{"$f":"IF(G144<999,I144,999)","v":0}]
[null,{"$f":"Grunddaten!A81","v":""},{"$f":"IF(Grunddaten!B81>0,Grunddaten!B81,\"NICHTSTARTER\")","v":"NICHTSTARTER"},{"$f":"IF(Grunddaten!C81>0,Grunddaten!C81,\"NICHTSTARTER\")","v":"NICHTSTARTER"},{"$f":"IF(M145=N144,\"x\",\"\")","v":""},{"$f":"IF(G145=K144,\"x\",\"\")","v":"x"},0,{"$f":"IF(E145=\"\",G145,\"0\")","v":0},0,{"$f":"IF(E145=\"\",I145,\"0\")","v":0},null,{"$f":"IF(F145=\"\",\"0\",I145)","v":0},{"$f":"L145+0.002","v":2E-3},null,0,0,{"$f":"IF(I145>0,1,0)","v":0},null,{"$f":"IF(G145<999,G145,999)","v":0},{"$f":"IF(G145<999,I145,999)","v":0}]
[null,{"$f":"Grunddaten!A82","v":""},{"$f":"IF(Grunddaten!B82>0,Grunddaten!B82,\"NICHTSTARTER\")","v":"NICHTSTARTER"},{"$f":"IF(Grunddaten!C82>0,Grunddaten!C82,\"NICHTSTARTER\")","v":"NICHTSTARTER"},{"$f":"IF(M146=N144,\"x\",\"\")","v":""},{"$f":"IF(G146=K144,\"x\",\"\")","v":"x"},0,{"$f":"IF(E146=\"\",G146,\"0\")","v":0},0,{"$f":"IF(E146=\"\",I146,\"0\")","v":0},null,{"$f":"IF(F146=\"\",\"0\",I146)","v":0},{"$f":"L146+0.003","v":3.0000000000000001E-3},null,0,0,{"$f":"IF(I146>0,1,0)","v":0},null,0,0]
[null,{"$f":"Grunddaten!A83","v":""},{"$f":"IF(Grunddaten!B83>0,Grunddaten!B83,\"NICHTSTARTER\")","v":"NICHTSTARTER"},{"$f":"IF(Grunddaten!C83>0,Grunddaten!C83,\"NICHTSTARTER\")","v":"NICHTSTARTER"},{"$f":"IF(M147=N144,\"x\",\"\")","v":"x"},{"$f":"IF(G147=K144,\"x\",\"\")","v":"x"},0,{"$f":"IF(E147=\"\",G147,\"0\")","v":"0"},0,{"$f":"IF(E147=\"\",I147,\"0\")","v":"0"},null,{"$f":"IF(F147=\"\",\"0\",I147)","v":0},{"$f":"L147+0.004","v":4.0000000000000001E-3},null,0,0,{"$f":"IF(I147>0,1,0)","v":0},null,0,0]
[null,null,null,null,null,null,{"$f":"H144+H145+H146+H147","v":0},null,{"$f":"J144+J145+J146+J147","v":0},null,null,null,null,null,{"$f":"O144+O145+O146+O147","v":0},{"$f":"P144+P145+P146+P147","v":0},{"$f":"SUM(Q144:Q147)","v":0},null,{"$f":"IF(G148<999,SUM(S144:S147),999)","v":0},{"$f":"IF(G148<999,SUM(T144:T147),999)","v":0}]
[]
[19,"Equipe:",{"$f":"Grunddaten!D84","v":"172"},null,null,null,"Normalparcours",null,null,null,null,null,null,null,"Stechen"]
[null,null,"Reiter","Pferd",null,null,"Fehler",null,"Zeit",null,null,null,null,null,"Fehler","Zeit"]
[null,{"$f":"Grunddaten!A84","v":""},{"$f":"IF(Grunddaten!B84>0,Grunddaten!B84,\"NICHTSTARTER\")","v":"NICHTSTARTER"},{"$f":"IF(Grunddaten!C84>0,Grunddaten!C84,\"NICHTSTARTER\")","v":"NICHTSTARTER"},{"$f":"IF(M152=N152,\"x\",\"\")","v":""},{"$f":"IF(G152=K152,\"x\",\"\")","v":"x"},0,{"$f":"IF(E152=\"\",G152,\"0\")","v":0},0,{"$f":"IF(E152=\"\",I152,\"0\")","v":0},{"$f":"LARGE(G152:G155,1)","v":0},{"$f":"IF(F152=\"\",\"0\",I152)","v":0},{"$f":"L152+0.001","v":1E-3},{"$f":"LARGE(M152:M155,1)","v":4.0000000000000001E-3},0,0,{"$f":"IF(I152>0,1,0)","v":0},null,{"$f":"IF(G152<999,G152,999)","v":0},{"$f":"IF(G152<999,I152,999)","v":0}]
[null,{"$f":"Grunddaten!A85","v":""},{"$f":"IF(Grunddaten!B85>0,Grunddaten!B85,\"NICHTSTARTER\")","v":"NICHTSTARTER"},{"$f":"IF(Grunddaten!C85>0,Grunddaten!C85,\"NICHTSTARTER\")","v":"NICHTSTARTER"},{"$f":"IF(M153=N152,\"x\",\"\")","v":""},{"$f":"IF(G153=K152,\"x\",\"\")","v":"x"},0,{"$f":"IF(E153=\"\",G153,\"0\")","v":0},0,{"$f":"IF(E153=\"\",I153,\"0\")","v":0},null,{"$f":"IF(F153=\"\",\"0\",I153)","v":0},{"$f":"L153+0.002","v":2E-3},null,0,0,{"$f":"IF(I153>0,1,0)","v":0},null,{"$f":"IF(G153<999,G153,999)","v":0},{"$f":"IF(G153<999,I153,999)","v":0}]
[null,{"$f":"Grunddaten!A86","v":""},{"$f":"IF(Grunddaten!B86>0,Grunddaten!B86,\"NICHTSTARTER\")","v":"NICHTSTARTER"},{"$f":"IF(Grunddaten!C86>0,Grunddaten!C86,\"NICHTSTARTER\")","v":"NICHTSTARTER"},{"$f":"IF(M154=N152,\"x\",\"\")","v":""},{"$f":"IF(G154=K152,\"x\",\"\")","v":"x"},0,{"$f":"IF(E154=\"\",G154,\"0\")","v":0},0,{"$f":"IF(E154=\"\",I154,\"0\")","v":0},null,{"$f":"IF(F154=\"\",\"0\",I154)","v":0},{"$f":"L154+0.003","v":3.0000000000000001E-3},null,0,0,{"$f":"IF(I154>0,1,0)","v":0},null,0,0]
[null,{"$f":"Grunddaten!A87","v":""},{"$f":"IF(Grunddaten!B87>0,Grunddaten!B87,\"NICHTSTARTER\")","v":"NICHTSTARTER"},{"$f":"IF(Grunddaten!C87>0,Grunddaten!C87,\"NICHTSTARTER\")","v":"NICHTSTARTER"},{"$f":"IF(M155=N152,\"x\",\"\")","v":"x"},{"$f":"IF(G155=K152,\"x\",\"\")","v":"x"},0,{"$f":"IF(E155=\"\",G155,\"0\")","v":"0"},0,{"$f":"IF(E155=\"\",I155,\"0\")","v":"0"},null,{"$f":"IF(F155=\"\",\"0\",I155)","v":0},{"$f":"L155+0.004","v":4.0000000000000001E-3},null,0,0,{"$f":"IF(I155>0,1,0)","v":0},null,0,0]
[null,null,null,null,null,null,{"$f":"H152+H153+H154+H155","v":0},null,{"$f":"J152+J153+J154+J155","v":0},null,null,null,null,null,{"$f":"O152+O153+O154+O155","v":0},{"$f":"P152+P153+P154+P155","v":0},{"$f":"SUM(Q152:Q155)","v":0},null,{"$f":"IF(G156<999,SUM(S152:S155),999)","v":0},{"$f":"IF(G156<999,SUM(T152:T155),999)","v":0}]
[]
[20,"Equipe:",{"$f":"Grunddaten!D88","v":"176"},null,null,null,"Normalparcours",null,null,null,null,null,null,null,"Stechen"]
[null,null,"Reiter","Pferd",null,null,"Fehler",null,"Zeit",null,null,null,null,null,"Fehler","Zeit"]
[null,{"$f":"Grunddaten!A88","v":""},{"$f":"IF(Grunddaten!B88>0,Grunddaten!B88,\"NICHTSTARTER\")","v":"NICHTSTARTER"},{"$f":"IF(Grunddaten!C88>0,Grunddaten!C88,\"NICHTSTARTER\")","v":"NICHTSTARTER"},{"$f":"IF(M160=N160,\"x\",\"\")","v":""},{"$f":"IF(G160=K160,\"x\",\"\")","v":"x"},0,{"$f":"IF(E160=\"\",G160,\"0\")","v":0},0,{"$f":"IF(E160=\"\",I160,\"0\")","v":0},{"$f":"LARGE(G160:G163,1)","v":0},{"$f":"IF(F160=\"\",\"0\",I160)","v":0},{"$f":"L160+0.001","v":1E-3},{"$f":"LARGE(M160:M163,1)","v":4.0000000000000001E-3},0,0,{"$f":"IF(I160>0,1,0)","v":0},null,{"$f":"IF(G160<999,G160,999)","v":0},{"$f":"IF(G160<999,I160,999)","v":0}]
[null,{"$f":"Grunddaten!A89","v":""},{"$f":"IF(Grunddaten!B89>0,Grunddaten!B89,\"NICHTSTARTER\")","v":"NICHTSTARTER"},{"$f":"IF(Grunddaten!C89>0,Grunddaten!C89,\"NICHTSTARTER\")","v":"NICHTSTARTER"},{"$f":"IF(M161=N160,\"x\",\"\")","v":""},{"$f":"IF(G161=K160,\"x\",\"\")","v":"x"},0,{"$f":"IF(E161=\"\",G161,\"0\")","v":0},0,{"$f":"IF(E161=\"\",I161,\"0\")","v":0},null,{"$f":"IF(F161=\"\",\"0\",I161)","v":0},{"$f":"L161+0.002","v":2E-3},null,0,0,{"$f":"IF(I161>0,1,0)","v":0},null,{"$f":"IF(G161<999,G161,999)","v":0},{"$f":"IF(G161<999,I161,999)","v":0}]
[null,{"$f":"Grunddaten!A90","v":""},{"$f":"IF(Grunddaten!B90>0,Grunddaten!B90,\"NICHTSTARTER\")","v":"NICHTSTARTER"},{"$f":"IF(Grunddaten!C90>0,Grunddaten!C90,\"NICHTSTARTER\")","v":"NICHTSTARTER"},{"$f":"IF(M162=N160,\"x\",\"\")","v":""},{"$f":"IF(G162=K160,\"x\",\"\")","v":"x"},0,{"$f":"IF(E162=\"\",G162,\"0\")","v":0},0,{"$f":"IF(E162=\"\",I162,\"0\")","v":0},null,{"$f":"IF(F162=\"\",\"0\",I162)","v":0},{"$f":"L162+0.003","v":3.0000000000000001E-3},null,0,0,{"$f":"IF(I162>0,1,0)","v":0},null,0,0]
[null,{"$f":"Grunddaten!A91","v":""},{"$f":"IF(Grunddaten!B91>0,Grunddaten!B91,\"NICHTSTARTER\")","v":"NICHTSTARTER"},{"$f":"IF(Grunddaten!C91>0,Grunddaten!C91,\"NICHTSTARTER\")","v":"NICHTSTARTER"},{"$f":"IF(M163=N160,\"x\",\"\")","v":"x"},{"$f":"IF(G163=K160,\"x\",\"\")","v":"x"},0,{"$f":"IF(E163=\"\",G163,\"0\")","v":"0"},0,{"$f":"IF(E163=\"\",I163,\"0\")","v":"0"},null,{"$f":"IF(F163=\"\",\"0\",I163)","v":0},{"$f":"L163+0.004","v":4.0000000000000001E-3},null,0,0,{"$f":"IF(I163>0,1,0)","v":0},null,0,0]
[null,null,null,null,null,null,{"$f":"H160+H161+H162+H163","v":0},null,{"$f":"J160+J161+J162+J163","v":0},null,null,null,null,null,{"$f":"O160+O161+O162+O163","v":0},{"$f":"P160+P161+P162+P163","v":0},{"$f":"SUM(Q160:Q163)","v":0},null,{"$f":"IF(G164<999,SUM(S160:S163),999)","v":0},{"$f":"IF(G164<999,SUM(T160:T163),999)","v":0}]

{"sheet":"Pruefungsrangliste","index":3,"n_rows":29,"n_cols":19,"rows_kept":29,"cut":false,"hidden":false,"merged":[[5,0,5,6],[7,3,7,4],[7,5,7,6],[0,0,0,6],[1,0,1,6],[2,0,2,6],[3,0,3,6]]}
[{"$f":"Pruefung!A1","v":"Pferdesporttage"}]
[{"$f":"Pruefung!A2","v":"OKV Vereins-Cup"}]
[{"$f":"Pruefung!A3","v":"Preis der…"}]
[{"$f":"Pruefung!A4","v":"Dieses Dokument wurde erstellt von David Stadelmann - 076 561 41 21"}]
[]
["Prüfungsrangliste"]
[]
[null,null,"Streichresultat NICHT berücksichtigt","Normalparcours",null,"Stechen"]
["Rang","Start-Nr.","Equipe","Fehler","Zeit","Fehler","Zeit"]
[{"$f":"IF(E10>1,1,\"\")","v":""},{"$f":"Pruefung!A6","v":1},{"$f":"IF(D10=\"Nichtstarter\",\"\",Pruefung!C6)","v":""},{"$f":"IF($C$8=\"Streichresultat berücksichtigt\",L10,M10)","v":"Nichtstarter"},{"$f":"IF(D10=\"Ausg.\",0,IF($C$8=\"Streichresultat berücksichtigt\",N10,O10))","v":0},{"$f":"IF(D10=\"Nichtstarter\",\"+++\",IF(D10=\"Ausg.\",\"***\",IF(Pruefung!P12<0.1,\"---\",IF(Pruefung!O12>998,999,Pruefung!O12))))","v":"+++"},{"$f":"Pruefung!P12","v":0},{"$f":"IF(Pruefung!$I$8=0,-2,(IF(Pruefung!$I$8=1,-3,(IF(Pruefung!$I$8>1,Pruefung!$G$8)))))","v":-2},{"$f":"IF(Pruefung!$I$9=0,-2,(IF(Pruefung!$I$9=1,-3,(IF(Pruefung!$I$9>1,Pruefung!$G$9)))))","v":-2},{"$f":"IF(Pruefung!$I$10=0,-2,(IF(Pruefung!$I$10=1,-3,(IF(Pruefung!$I$10>1,Pruefung!$G$10)))))","v":-2},{"$f":"IF(Pruefung!$I$11=0,-2,(IF(Pruefung!$I$11=1,-3,(IF(Pruefung!$I$11>1,Pruefung!$G$11)))))","v":-2},{"$f":"IF(Grunddaten!$B12<1,\"Nichtstarter\",(IF(Pruefung!$G12>998,\"Ausg.\",(IF(Pruefung!$Q12>1,Pruefung!$G12,Pruefung!S8)))))","v":"Nichtstarter"},{"$f":"IF(Grunddaten!$B12<1,\"Nichtstarter\",(IF(Pruefung!$G12>998,\"Ausg.\",(IF(Pruefung!$Q12>0,Pruefung!$S12,0)))))","v":"Nichtstarter"},{"$f":"IF(Pruefung!$Q12>1,Pruefung!$I12,Pruefung!T12)","v":0},{"$f":"IF(Pruefung!$Q12>0,Pruefung!$T12,0)","v":0},{"$f":"IF(D10=\"Nichtstarter\",9999,IF(D10=\"Ausg.\",9998,D10))","v":9999},{"$f":"E10","v":0},{"$f":"IF(F10=\"+++\",9999,IF(F10=\"---\",9998,F10))","v":9999},{"$f":"G10","v":0}]
[{"$f":"IF(D11=\"Nichtstarter\",\"\",IF(G11=0,IF(AND(D11=D10,E11=E10),A10,2),IF(G11>0,IF(AND(F11=F10,G11=G10),A10,2))))","v":""},{"$f":"Pruefung!A14","v":2},{"$f":"IF(D11=\"Nichtstarter\",\"\",Pruefung!C14)","v":""},"Nichtstarter",0,{"$f":"IF(D11=\"Nichtstarter\",\"+++\",IF(D11=\"Ausg.\",\"***\",IF(Pruefung!P20<0.1,\"---\",IF(Pruefung!O20>998,999,Pruefung!O20))))","v":"+++"},{"$f":"Pruefung!P20","v":0},{"$f":"IF(Pruefung!$I$16=0,-2,(IF(Pruefung!$I$16=1,-3,(IF(Pruefung!$I$16>1,Pruefung!$G$16)))))","v":-2},{"$f":"IF(Pruefung!$I$17=0,-2,(IF(Pruefung!$I$17=1,-3,(IF(Pruefung!$I$17>1,Pruefung!$G$17)))))","v":-2},{"$f":"IF(Pruefung!$I$18=0,-2,(IF(Pruefung!$I$18=1,-3,(IF(Pruefung!$I$18>1,Pruefung!$G$18)))))","v":-2},{"$f":"IF(Pruefung!$I$19=0,-2,(IF(Pruefung!$I$19=1,-3,(IF(Pruefung!$I$19>1,Pruefung!$G$19)))))","v":-2},{"$f":"IF(Grunddaten!$B16<1,\"Nichtstarter\",(IF(Pruefung!$G20>998,\"Ausg.\",(IF(Pruefung!$Q20>1,Pruefung!$G20,Pruefung!S16)))))","v":"Nichtstarter"},{"$f":"IF(Grunddaten!$B16<1,\"Nichtstarter\",(IF(Pruefung!$G20>998,\"Ausg.\",(IF(Pruefung!$Q20>0,Pruefung!$S20,0)))))","v":"Nichtstarter"},{"$f":"IF(Pruefung!$Q20>1,Pruefung!$I20,Pruefung!T20)","v":0},{"$f":"IF(Pruefung!$Q20>0,Pruefung!$T20,0)","v":0},9999,0,9999,0]
[{"$f":"IF(D12=\"Nichtstarter\",\"\",IF(G12=0,IF(AND(D12=D11,E12=E11),A11,3),IF(G12>0,IF(AND(F12=F11,G12=G11),A11,3))))","v":""},{"$f":"Pruefung!A22","v":3},{"$f":"IF(D12=\"Nichtstarter\",\"\",Pruefung!C22)","v":""},"Nichtstarter",0,{"$f":"IF(D12=\"Nichtstarter\",\"+++\",IF(D12=\"Ausg.\",\"***\",IF(Pruefung!P28<0.1,\"---\",IF(Pruefung!O28>998,999,Pruefung!O28))))","v":"+++"},{"$f":"Pruefung!P28","v":0},{"$f":"IF(Pruefung!$I$24=0,-2,(IF(Pruefung!$I$24=1,-3,(IF(Pruefung!$I$24>1,Pruefung!$G$24)))))","v":-2},{"$f":"IF(Pruefung!$I$25=0,-2,(IF(Pruefung!$I$25=1,-3,(IF(Pruefung!$I$25>1,Pruefung!$G$25)))))","v":-2},{"$f":"IF(Pruefung!$I$26=0,-2,(IF(Pruefung!$I$26=1,-3,(IF(Pruefung!$I$26>1,Pruefung!$G$26)))))","v":-2},{"$f":"IF(Pruefung!$I$27=0,-2,(IF(Pruefung!$I$27=1,-3,(IF(Pruefung!$I$27>1,Pruefung!$G$27)))))","v":-2},{"$f":"IF(Grunddaten!$B20<1,\"Nichtstarter\",(IF(Pruefung!$G28>998,\"Ausg.\",(IF(Pruefung!$Q28>1,Pruefung!$G28,Pruefung!S24)))))","v":"Nichtstarter"},{"$f":"IF(Grunddaten!$B20<1,\"Nichtstarter\",(IF(Pruefung!$G28>998,\"Ausg.\",(IF(Pruefung!$Q28>0,Pruefung!$S28,0)))))","v":"Nichtstarter"},{"$f":"IF(Pruefung!$Q28>1,Pruefung!$I28,Pruefung!T28)","v":0},{"$f":"IF(Pruefung!$Q28>0,Pruefung!$T28,0)","v":0},9999,0,9999,0]
[{"$f":"IF(D13=\"Nichtstarter\",\"\",IF(G13=0,IF(AND(D13=D12,E13=E12),A12,4),IF(G13>0,IF(AND(F13=F12,G13=G12),A12,4))))","v":""},{"$f":"Pruefung!A30","v":4},{"$f":"IF(D13=\"Nichtstarter\",\"\",Pruefung!C30)","v":""},"Nichtstarter",0,{"$f":"IF(D13=\"Nichtstarter\",\"+++\",IF(D13=\"Ausg.\",\"***\",IF(Pruefung!P36<0.1,\"---\",IF(Pruefung!O36>998,999,Pruefung!O36))))","v":"+++"},{"$f":"Pruefung!P36","v":0},{"$f":"IF(Pruefung!$I$32=0,-2,(IF(Pruefung!$I$32=1,-3,(IF(Pruefung!$I$32>1,Pruefung!$G$32)))))","v":-2},{"$f":"IF(Pruefung!$I$33=0,-2,(IF(Pruefung!$I$33=1,-3,(IF(Pruefung!$I$33>1,Pruefung!$G$33)))))","v":-2},{"$f":"IF(Pruefung!$I$34=0,-2,(IF(Pruefung!$I$34=1,-3,(IF(Pruefung!$I$34>1,Pruefung!$G$34)))))","v":-2},{"$f":"IF(Pruefung!$I$35=0,-2,(IF(Pruefung!$I$35=1,-3,(IF(Pruefung!$I$35>1,Pruefung!$G$35)))))","v":-2},{"$f":"IF(Grunddaten!$B24<1,\"Nichtstarter\",(IF(Pruefung!$G36>998,\"Ausg.\",(IF(Pruefung!$Q36>1,Pruefung!$G36,Pruefung!S32)))))","v":"Nichtstarter"},{"$f":"IF(Grunddaten!$B24<1,\"Nichtstarter\",(IF(Pruefung!$G36>998,\"Ausg.\",(IF(Pruefung!$Q36>0,Pruefung!$S36,0)))))","v":"Nichtstarter"},{"$f":"IF(Pruefung!$Q36>1,Pruefung!$I36,Pruefung!T36)","v":0},{"$f":"IF(Pruefung!$Q36>0,Pruefung!$T36,0)","v":0},9999,0,9999,0]
[{"$f":"IF(D14=\"Nichtstarter\",\"\",IF(G14=0,IF(AND(D14=D13,E14=E13),A13,5),IF(G14>0,IF(AND(F14=F13,G14=G13),A13,5))))","v":""},{"$f":"Pruefung!A38","v":5},{"$f":"IF(D14=\"Nichtstarter\",\"\",Pruefung!C38)","v":""},"Nichtstarter",0,{"$f":"IF(D14=\"Nichtstarter\",\"+++\",IF(D14=\"Ausg.\",\"***\",IF(Pruefung!P44<0.1,\"---\",IF(Pruefung!O44>998,999,Pruefung!O44))))","v":"+++"},{"$f":"Pruefung!P44","v":0},{"$f":"IF(Pruefung!$I$40=0,-2,(IF(Pruefung!$I$40=1,-3,(IF(Pruefung!$I$40>1,Pruefung!$G$40)))))","v":-2},{"$f":"IF(Pruefung!$I$41=0,-2,(IF(Pruefung!$I$41=1,-3,(IF(Pruefung!$I$41>1,Pruefung!$G$41)))))","v":-2},{"$f":"IF(Pruefung!$I$42=0,-2,(IF(Pruefung!$I$42=1,-3,(IF(Pruefung!$I$42>1,Pruefung!$G$42)))))","v":-2},{"$f":"IF(Pruefung!$I$43=0,-2,(IF(Pruefung!$I$43=1,-3,(IF(Pruefung!$I$43>1,Pruefung!$G$43)))))","v":-2},{"$f":"IF(Grunddaten!$B28<1,\"Nichtstarter\",(IF(Pruefung!$G44>998,\"Ausg.\",(IF(Pruefung!$Q44>1,Pruefung!$G44,Pruefung!S40)))))","v":"Nichtstarter"},{"$f":"IF(Grunddaten!$B28<1,\"Nichtstarter\",(IF(Pruefung!$G44>998,\"Ausg.\",(IF(Pruefung!$Q44>0,Pruefung!$S44,0)))))","v":"Nichtstarter"},{"$f":"IF(Pruefung!$Q44>1,Pruefung!$I44,Pruefung!T44)","v":0},{"$f":"IF(Pruefung!$Q44>0,Pruefung!$T44,0)","v":0},9999,0,9999,0]
[{"$f":"IF(D15=\"Nichtstarter\",\"\",IF(G15=0,IF(AND(D15=D14,E15=E14),A14,6),IF(G15>0,IF(AND(F15=F14,G15=G14),A14,6))))","v":""},{"$f":"Pruefung!A46","v":6},{"$f":"IF(D15=\"Nichtstarter\",\"\",Pruefung!C46)","v":""},"Nichtstarter",0,{"$f":"IF(D15=\"Nichtstarter\",\"+++\",IF(D15=\"Ausg.\",\"***\",IF(Pruefung!P52<0.1,\"---\",IF(Pruefung!O52>998,999,Pruefung!O52))))","v":"+++"},{"$f":"Pruefung!P52","v":0},{"$f":"IF(Pruefung!$I$48=0,-2,(IF(Pruefung!$I$48=1,-3,(IF(Pruefung!$I$48>1,Pruefung!$G$48)))))","v":-2},{"$f":"IF(Pruefung!$I$49=0,-2,(IF(Pruefung!$I$49=1,-3,(IF(Pruefung!$I$49>1,Pruefung!$G$49)))))","v":-2},{"$f":"IF(Pruefung!$I$50=0,-2,(IF(Pruefung!$I$50=1,-3,(IF(Pruefung!$I$50>1,Pruefung!$G$50)))))","v":-2},{"$f":"IF(Pruefung!$I$51=0,-2,(IF(Pruefung!$I$51=1,-3,(IF(Pruefung!$I$51>1,Pruefung!$G$51)))))","v":-2},{"$f":"IF(Grunddaten!$B32<1,\"Nichtstarter\",(IF(Pruefung!$G52>998,\"Ausg.\",(IF(Pruefung!$Q52>1,Pruefung!$G52,Pruefung!S48)))))","v":"Nichtstarter"},{"$f":"IF(Grunddaten!$B32<1,\"Nichtstarter\",(IF(Pruefung!$G52>998,\"Ausg.\",(IF(Pruefung!$Q52>0,Pruefung!$S52,0)))))","v":"Nichtstarter"},{"$f":"IF(Pruefung!$Q52>1,Pruefung!$I52,Pruefung!T52)","v":0},{"$f":"IF(Pruefung!$Q52>0,Pruefung!$T52,0)","v":0},9999,0,9999,0]
[{"$f":"IF(D16=\"Nichtstarter\",\"\",IF(G16=0,IF(AND(D16=D15,E16=E15),A15,7),IF(G16>0,IF(AND(F16=F15,G16=G15),A15,7))))","v":""},{"$f":"Pruefung!A54","v":7},{"$f":"IF(D16=\"Nichtstarter\",\"\",Pruefung!C54)","v":""},"Nichtstarter",0,{"$f":"IF(D16=\"Nichtstarter\",\"+++\",IF(D16=\"Ausg.\",\"***\",IF(Pruefung!P60<0.1,\"---\",IF(Pruefung!O60>998,999,Pruefung!O60))))","v":"+++"},{"$f":"Pruefung!P60","v":0},{"$f":"IF(Pruefung!$I$56=0,-2,(IF(Pruefung!$I$56=1,-3,(IF(Pruefung!$I$56>1,Pruefung!$G$56)))))","v":-2},{"$f":"IF(Pruefung!$I$57=0,-2,(IF(Pruefung!$I$57=1,-3,(IF(Pruefung!$I$57>1,Pruefung!$G$57)))))","v":-2},{"$f":"IF(Pruefung!$I$58=0,-2,(IF(Pruefung!$I$58=1,-3,(IF(Pruefung!$I$58>1,Pruefung!$G$58)))))","v":-2},{"$f":"IF(Pruefung!$I$59=0,-2,(IF(Pruefung!$I$59=1,-3,(IF(Pruefung!$I$59>1,Pruefung!$G$59)))))","v":-2},{"$f":"IF(Grunddaten!$B36<1,\"Nichtstarter\",(IF(Pruefung!$G60>998,\"Ausg.\",(IF(Pruefung!$Q60>1,Pruefung!$G60,Pruefung!S56)))))","v":"Nichtstarter"},{"$f":"IF(Grunddaten!$B36<1,\"Nichtstarter\",(IF(Pruefung!$G60>998,\"Ausg.\",(IF(Pruefung!$Q60>0,Pruefung!$S60,0)))))","v":"Nichtstarter"},{"$f":"IF(Pruefung!$Q60>1,Pruefung!$I60,Pruefung!T60)","v":0},{"$f":"IF(Pruefung!$Q60>0,Pruefung!$T60,0)","v":0},9999,0,9999,0]
[{"$f":"IF(D17=\"Nichtstarter\",\"\",IF(G17=0,IF(AND(D17=D16,E17=E16),A16,8),IF(G17>0,IF(AND(F17=F16,G17=G16),A16,8))))","v":""},{"$f":"Pruefung!A62","v":8},{"$f":"IF(D17=\"Nichtstarter\",\"\",Pruefung!C62)","v":""},"Nichtstarter",0,{"$f":"IF(D17=\"Nichtstarter\",\"+++\",IF(D17=\"Ausg.\",\"***\",IF(Pruefung!P68<0.1,\"---\",IF(Pruefung!O68>998,999,Pruefung!O68))))","v":"+++"},{"$f":"Pruefung!P68","v":0},{"$f":"IF(Pruefung!$I$64=0,-2,(IF(Pruefung!$I$64=1,-3,(IF(Pruefung!$I$64>1,Pruefung!$G$64)))))","v":-2},{"$f":"IF(Pruefung!$I$65=0,-2,(IF(Pruefung!$I$65=1,-3,(IF(Pruefung!$I$65>1,Pruefung!$G$65)))))","v":-2},{"$f":"IF(Pruefung!$I$66=0,-2,(IF(Pruefung!$I$66=1,-3,(IF(Pruefung!$I$66>1,Pruefung!$G$66)))))","v":-2},{"$f":"IF(Pruefung!$I$67=0,-2,(IF(Pruefung!$I$67=1,-3,(IF(Pruefung!$I$67>1,Pruefung!$G$67)))))","v":-2},{"$f":"IF(Grunddaten!$B40<1,\"Nichtstarter\",(IF(Pruefung!$G68>998,\"Ausg.\",(IF(Pruefung!$Q68>1,Pruefung!$G68,Pruefung!S64)))))","v":"Nichtstarter"},{"$f":"IF(Grunddaten!$B40<1,\"Nichtstarter\",(IF(Pruefung!$G68>998,\"Ausg.\",(IF(Pruefung!$Q68>0,Pruefung!$S68,0)))))","v":"Nichtstarter"},{"$f":"IF(Pruefung!$Q68>1,Pruefung!$I68,Pruefung!T68)","v":0},{"$f":"IF(Pruefung!$Q68>0,Pruefung!$T68,0)","v":0},9999,0,9999,0]
[{"$f":"IF(D18=\"Nichtstarter\",\"\",IF(G18=0,IF(AND(D18=D17,E18=E17),A17,9),IF(G18>0,IF(AND(F18=F17,G18=G17),A17,9))))","v":""},{"$f":"Pruefung!A70","v":9},{"$f":"IF(D18=\"Nichtstarter\",\"\",Pruefung!C70)","v":""},"Nichtstarter",0,{"$f":"IF(D18=\"Nichtstarter\",\"+++\",IF(D18=\"Ausg.\",\"***\",IF(Pruefung!P76<0.1,\"---\",IF(Pruefung!O76>998,999,Pruefung!O76))))","v":"+++"},{"$f":"Pruefung!P76","v":0},{"$f":"IF(Pruefung!$I$72=0,-2,(IF(Pruefung!$I$72=1,-3,(IF(Pruefung!$I$72>1,Pruefung!$G$72)))))","v":-2},{"$f":"IF(Pruefung!$I$73=0,-2,(IF(Pruefung!$I$73=1,-3,(IF(Pruefung!$I$73>1,Pruefung!$G$73)))))","v":-2},{"$f":"IF(Pruefung!$I$74=0,-2,(IF(Pruefung!$I$74=1,-3,(IF(Pruefung!$I$74>1,Pruefung!$G$74)))))","v":-2},{"$f":"IF(Pruefung!$I$75=0,-2,(IF(Pruefung!$I$75=1,-3,(IF(Pruefung!$I$75>1,Pruefung!$G$75)))))","v":-2},{"$f":"IF(Grunddaten!$B44<1,\"Nichtstarter\",(IF(Pruefung!$G76>998,\"Ausg.\",(IF(Pruefung!$Q76>1,Pruefung!$G76,Pruefung!S72)))))","v":"Nichtstarter"},{"$f":"IF(Grunddaten!$B44<1,\"Nichtstarter\",(IF(Pruefung!$G76>998,\"Ausg.\",(IF(Pruefung!$Q76>0,Pruefung!$S76,0)))))","v":"Nichtstarter"},{"$f":"IF(Pruefung!$Q76>1,Pruefung!$I76,Pruefung!T76)","v":0},{"$f":"IF(Pruefung!$Q76>0,Pruefung!$T76,0)","v":0},9999,0,9999,0]
[{"$f":"IF(D19=\"Nichtstarter\",\"\",IF(G19=0,IF(AND(D19=D18,E19=E18),A18,10),IF(G19>0,IF(AND(F19=F18,G19=G18),A18,10))))","v":""},{"$f":"Pruefung!A78","v":10},{"$f":"IF(D19=\"Nichtstarter\",\"\",Pruefung!C78)","v":""},"Nichtstarter",0,{"$f":"IF(D19=\"Nichtstarter\",\"+++\",IF(D19=\"Ausg.\",\"***\",IF(Pruefung!P84<0.1,\"---\",IF(Pruefung!O84>998,999,Pruefung!O84))))","v":"+++"},{"$f":"Pruefung!P84","v":0},{"$f":"IF(Pruefung!$I$80=0,-2,(IF(Pruefung!$I$80=1,-3,(IF(Pruefung!$I$80>1,Pruefung!$G$80)))))","v":-2},{"$f":"IF(Pruefung!$I$81=0,-2,(IF(Pruefung!$I$81=1,-3,(IF(Pruefung!$I$81>1,Pruefung!$G$81)))))","v":-2},{"$f":"IF(Pruefung!$I$82=0,-2,(IF(Pruefung!$I$82=1,-3,(IF(Pruefung!$I$82>1,Pruefung!$G$82)))))","v":-2},{"$f":"IF(Pruefung!$I$83=0,-2,(IF(Pruefung!$I$83=1,-3,(IF(Pruefung!$I$83>1,Pruefung!$G$83)))))","v":-2},{"$f":"IF(Grunddaten!$B48<1,\"Nichtstarter\",(IF(Pruefung!$G84>998,\"Ausg.\",(IF(Pruefung!$Q84>1,Pruefung!$G84,Pruefung!S80)))))","v":"Nichtstarter"},{"$f":"IF(Grunddaten!$B48<1,\"Nichtstarter\",(IF(Pruefung!$G84>998,\"Ausg.\",(IF(Pruefung!$Q84>0,Pruefung!$S84,0)))))","v":"Nichtstarter"},{"$f":"IF(Pruefung!$Q84>1,Pruefung!$I84,Pruefung!T84)","v":0},{"$f":"IF(Pruefung!$Q84>0,Pruefung!$T84,0)","v":0},9999,0,9999,0]
[{"$f":"IF(D20=\"Nichtstarter\",\"\",IF(G20=0,IF(AND(D20=D19,E20=E19),A19,11),IF(G20>0,IF(AND(F20=F19,G20=G19),A19,11))))","v":""},{"$f":"Pruefung!A86","v":11},{"$f":"IF(D20=\"Nichtstarter\",\"\",Pruefung!C86)","v":""},"Nichtstarter",0,{"$f":"IF(D20=\"Nichtstarter\",\"+++\",IF(D20=\"Ausg.\",\"***\",IF(Pruefung!P92<0.1,\"---\",IF(Pruefung!O92>998,999,Pruefung!O92))))","v":"+++"},{"$f":"Pruefung!P92","v":0},{"$f":"IF(Pruefung!$I$88=0,-2,(IF(Pruefung!$I$88=1,-3,(IF(Pruefung!$I$88>1,Pruefung!$G$88)))))","v":-2},{"$f":"IF(Pruefung!$I$89=0,-2,(IF(Pruefung!$I$89=1,-3,(IF(Pruefung!$I$89>1,Pruefung!$G$89)))))","v":-2},{"$f":"IF(Pruefung!$I$90=0,-2,(IF(Pruefung!$I$90=1,-3,(IF(Pruefung!$I$90>1,Pruefung!$G$90)))))","v":-2},{"$f":"IF(Pruefung!$I$91=0,-2,(IF(Pruefung!$I$91=1,-3,(IF(Pruefung!$I$91>1,Pruefung!$G$91)))))","v":-2},{"$f":"IF(Grunddaten!$B52<1,\"Nichtstarter\",(IF(Pruefung!$G92>998,\"Ausg.\",(IF(Pruefung!$Q92>1,Pruefung!$G92,Pruefung!S88)))))","v":"Nichtstarter"},{"$f":"IF(Grunddaten!$B52<1,\"Nichtstarter\",(IF(Pruefung!$G92>998,\"Ausg.\",(IF(Pruefung!$Q92>0,Pruefung!$S92,0)))))","v":"Nichtstarter"},{"$f":"IF(Pruefung!$Q92>1,Pruefung!$I92,Pruefung!T92)","v":0},{"$f":"IF(Pruefung!$Q92>0,Pruefung!$T92,0)","v":0},9999,0,9999,0]
[{"$f":"IF(D21=\"Nichtstarter\",\"\",IF(G21=0,IF(AND(D21=D20,E21=E20),A20,12),IF(G21>0,IF(AND(F21=F20,G21=G20),A20,12))))","v":""},{"$f":"Pruefung!A94","v":12},{"$f":"IF(D21=\"Nichtstarter\",\"\",Pruefung!C94)","v":""},"Nichtstarter",0,{"$f":"IF(D21=\"Nichtstarter\",\"+++\",IF(D21=\"Ausg.\",\"***\",IF(Pruefung!P100<0.1,\"---\",IF(Pruefung!O100>998,999,Pruefung!O100))))","v":"+++"},{"$f":"Pruefung!P100","v":0},{"$f":"IF(Pruefung!$I$96=0,-2,(IF(Pruefung!$I$96=1,-3,(IF(Pruefung!$I$96>1,Pruefung!$G$96)))))","v":-2},{"$f":"IF(Pruefung!$I$97=0,-2,(IF(Pruefung!$I$97=1,-3,(IF(Pruefung!$I$97>1,Pruefung!$G$97)))))","v":-2},{"$f":"IF(Pruefung!$I$98=0,-2,(IF(Pruefung!$I$98=1,-3,(IF(Pruefung!$I$98>1,Pruefung!$G$98)))))","v":-2},{"$f":"IF(Pruefung!$I$99=0,-2,(IF(Pruefung!$I$99=1,-3,(IF(Pruefung!$I$99>1,Pruefung!$G$99)))))","v":-2},{"$f":"IF(Grunddaten!$B56<1,\"Nichtstarter\",(IF(Pruefung!$G100>998,\"Ausg.\",(IF(Pruefung!$Q100>1,Pruefung!$G100,Pruefung!S96)))))","v":"Nichtstarter"},{"$f":"IF(Grunddaten!$B56<1,\"Nichtstarter\",(IF(Pruefung!$G100>998,\"Ausg.\",(IF(Pruefung!$Q100>0,Pruefung!$S100,0)))))","v":"Nichtstarter"},{"$f":"IF(Pruefung!$Q100>1,Pruefung!$I100,Pruefung!T100)","v":0},{"$f":"IF(Pruefung!$Q100>0,Pruefung!$T100,0)","v":0},9999,0,9999,0]
[{"$f":"IF(D22=\"Nichtstarter\",\"\",IF(G22=0,IF(AND(D22=D21,E22=E21),A21,13),IF(G22>0,IF(AND(F22=F21,G22=G21),A21,13))))","v":""},{"$f":"Pruefung!A102","v":13},{"$f":"IF(D22=\"Nichtstarter\",\"\",Pruefung!C102)","v":""},"Nichtstarter",0,{"$f":"IF(D22=\"Nichtstarter\",\"+++\",IF(D22=\"Ausg.\",\"***\",IF(Pruefung!P108<0.1,\"---\",IF(Pruefung!O108>998,999,Pruefung!O108))))","v":"+++"},{"$f":"Pruefung!P108","v":0},{"$f":"IF(Pruefung!$I$104=0,-2,(IF(Pruefung!$I$104=1,-3,(IF(Pruefung!$I$104>1,Pruefung!$G$104)))))","v":-2},{"$f":"IF(Pruefung!$I$105=0,-2,(IF(Pruefung!$I$105=1,-3,(IF(Pruefung!$I$105>1,Pruefung!$G$105)))))","v":-2},{"$f":"IF(Pruefung!$I$106=0,-2,(IF(Pruefung!$I$106=1,-3,(IF(Pruefung!$I$106>1,Pruefung!$G$106)))))","v":-2},{"$f":"IF(Pruefung!$I$107=0,-2,(IF(Pruefung!$I$107=1,-3,(IF(Pruefung!$I$107>1,Pruefung!$G$107)))))","v":-2},{"$f":"IF(Grunddaten!$B60<1,\"Nichtstarter\",(IF(Pruefung!$G108>998,\"Ausg.\",(IF(Pruefung!$Q108>1,Pruefung!$G108,Pruefung!S104)))))","v":"Nichtstarter"},{"$f":"IF(Grunddaten!$B60<1,\"Nichtstarter\",(IF(Pruefung!$G108>998,\"Ausg.\",(IF(Pruefung!$Q108>0,Pruefung!$S108,0)))))","v":"Nichtstarter"},{"$f":"IF(Pruefung!$Q108>1,Pruefung!$I108,Pruefung!T108)","v":0},{"$f":"IF(Pruefung!$Q108>0,Pruefung!$T108,0)","v":0},9999,0,9999,0]
[{"$f":"IF(D23=\"Nichtstarter\",\"\",IF(G23=0,IF(AND(D23=D22,E23=E22),A22,14),IF(G23>0,IF(AND(F23=F22,G23=G22),A22,14))))","v":""},{"$f":"Pruefung!A110","v":14},{"$f":"IF(D23=\"Nichtstarter\",\"\",Pruefung!C110)","v":""},"Nichtstarter",0,{"$f":"IF(D23=\"Nichtstarter\",\"+++\",IF(D23=\"Ausg.\",\"***\",IF(Pruefung!P116<0.1,\"---\",IF(Pruefung!O116>998,999,Pruefung!O116))))","v":"+++"},{"$f":"Pruefung!P116","v":0},{"$f":"IF(Pruefung!$I$112=0,-2,(IF(Pruefung!$I$112=1,-3,(IF(Pruefung!$I$112>1,Pruefung!$G$112)))))","v":-2},{"$f":"IF(Pruefung!$I$113=0,-2,(IF(Pruefung!$I$113=1,-3,(IF(Pruefung!$I$113>1,Pruefung!$G$113)))))","v":-2},{"$f":"IF(Pruefung!$I$114=0,-2,(IF(Pruefung!$I$114=1,-3,(IF(Pruefung!$I$114>1,Pruefung!$G$114)))))","v":-2},{"$f":"IF(Pruefung!$I$115=0,-2,(IF(Pruefung!$I$115=1,-3,(IF(Pruefung!$I$115>1,Pruefung!$G$115)))))","v":-2},{"$f":"IF(Grunddaten!$B64<1,\"Nichtstarter\",(IF(Pruefung!$G116>998,\"Ausg.\",(IF(Pruefung!$Q116>1,Pruefung!$G116,Pruefung!S112)))))","v":"Nichtstarter"},{"$f":"IF(Grunddaten!$B64<1,\"Nichtstarter\",(IF(Pruefung!$G116>998,\"Ausg.\",(IF(Pruefung!$Q116>0,Pruefung!$S116,0)))))","v":"Nichtstarter"},{"$f":"IF(Pruefung!$Q116>1,Pruefung!$I116,Pruefung!T116)","v":0},{"$f":"IF(Pruefung!$Q116>0,Pruefung!$T116,0)","v":0},9999,0,9999,0]
[{"$f":"IF(D24=\"Nichtstarter\",\"\",IF(G24=0,IF(AND(D24=D23,E24=E23),A23,15),IF(G24>0,IF(AND(F24=F23,G24=G23),A23,15))))","v":""},{"$f":"Pruefung!A118","v":15},{"$f":"IF(D24=\"Nichtstarter\",\"\",Pruefung!C118)","v":""},"Nichtstarter",0,{"$f":"IF(D24=\"Nichtstarter\",\"+++\",IF(D24=\"Ausg.\",\"***\",IF(Pruefung!P124<0.1,\"---\",IF(Pruefung!O124>998,999,Pruefung!O124))))","v":"+++"},{"$f":"Pruefung!P124","v":0},{"$f":"IF(Pruefung!$I$120=0,-2,(IF(Pruefung!$I$120=1,-3,(IF(Pruefung!$I$120>1,Pruefung!$G$120)))))","v":-2},{"$f":"IF(Pruefung!$I$121=0,-2,(IF(Pruefung!$I$121=1,-3,(IF(Pruefung!$I$121>1,Pruefung!$G$121)))))","v":-2},{"$f":"IF(Pruefung!$I$122=0,-2,(IF(Pruefung!$I$122=1,-3,(IF(Pruefung!$I$122>1,Pruefung!$G$122)))))","v":-2},{"$f":"IF(Pruefung!$I$123=0,-2,(IF(Pruefung!$I$123=1,-3,(IF(Pruefung!$I$123>1,Pruefung!$G$123)))))","v":-2},{"$f":"IF(Grunddaten!$B68<1,\"Nichtstarter\",(IF(Pruefung!$G124>998,\"Ausg.\",(IF(Pruefung!$Q124>1,Pruefung!$G124,Pruefung!S120)))))","v":"Nichtstarter"},{"$f":"IF(Grunddaten!$B68<1,\"Nichtstarter\",(IF(Pruefung!$G124>998,\"Ausg.\",(IF(Pruefung!$Q124>0,Pruefung!$S124,0)))))","v":"Nichtstarter"},{"$f":"IF(Pruefung!$Q124>1,Pruefung!$I124,Pruefung!T124)","v":0},{"$f":"IF(Pruefung!$Q124>0,Pruefung!$T124,0)","v":0},9999,0,9999,0]
[{"$f":"IF(D25=\"Nichtstarter\",\"\",IF(G25=0,IF(AND(D25=D24,E25=E24),A24,16),IF(G25>0,IF(AND(F25=F24,G25=G24),A24,16))))","v":""},{"$f":"Pruefung!A126","v":16},{"$f":"IF(D25=\"Nichtstarter\",\"\",Pruefung!C126)","v":""},"Nichtstarter",0,{"$f":"IF(D25=\"Nichtstarter\",\"+++\",IF(D25=\"Ausg.\",\"***\",IF(Pruefung!P132<0.1,\"---\",IF(Pruefung!O132>998,999,Pruefung!O132))))","v":"+++"},{"$f":"Pruefung!P132","v":0},{"$f":"IF(Pruefung!$I$128=0,-2,(IF(Pruefung!$I$128=1,-3,(IF(Pruefung!$I$128>1,Pruefung!$G$128)))))","v":-2},{"$f":"IF(Pruefung!$I$129=0,-2,(IF(Pruefung!$I$129=1,-3,(IF(Pruefung!$I$129>1,Pruefung!$G$129)))))","v":-2},{"$f":"IF(Pruefung!$I$130=0,-2,(IF(Pruefung!$I$130=1,-3,(IF(Pruefung!$I$130>1,Pruefung!$G$130)))))","v":-2},{"$f":"IF(Pruefung!$I$131=0,-2,(IF(Pruefung!$I$131=1,-3,(IF(Pruefung!$I$131>1,Pruefung!$G$131)))))","v":-2},{"$f":"IF(Grunddaten!$B72<1,\"Nichtstarter\",(IF(Pruefung!$G132>998,\"Ausg.\",(IF(Pruefung!$Q132>1,Pruefung!$G132,Pruefung!S128)))))","v":"Nichtstarter"},{"$f":"IF(Grunddaten!$B72<1,\"Nichtstarter\",(IF(Pruefung!$G132>998,\"Ausg.\",(IF(Pruefung!$Q132>0,Pruefung!$S132,0)))))","v":"Nichtstarter"},{"$f":"IF(Pruefung!$Q132>1,Pruefung!$I132,Pruefung!T132)","v":0},{"$f":"IF(Pruefung!$Q132>0,Pruefung!$T132,0)","v":0},9999,0,9999,0]
[{"$f":"IF(D26=\"Nichtstarter\",\"\",IF(G26=0,IF(AND(D26=D25,E26=E25),A25,17),IF(G26>0,IF(AND(F26=F25,G26=G25),A25,17))))","v":""},{"$f":"Pruefung!A134","v":17},{"$f":"IF(D26=\"Nichtstarter\",\"\",Pruefung!C134)","v":""},"Nichtstarter",0,{"$f":"IF(D26=\"Nichtstarter\",\"+++\",IF(D26=\"Ausg.\",\"***\",IF(Pruefung!P140<0.1,\"---\",IF(Pruefung!O140>998,999,Pruefung!O140))))","v":"+++"},{"$f":"Pruefung!P140","v":0},{"$f":"IF(Pruefung!$I$136=0,-2,(IF(Pruefung!$I$136=1,-3,(IF(Pruefung!$I$136>1,Pruefung!$G$136)))))","v":-2},{"$f":"IF(Pruefung!$I$137=0,-2,(IF(Pruefung!$I$137=1,-3,(IF(Pruefung!$I$137>1,Pruefung!$G$137)))))","v":-2},{"$f":"IF(Pruefung!$I$138=0,-2,(IF(Pruefung!$I$138=1,-3,(IF(Pruefung!$I$138>1,Pruefung!$G$138)))))","v":-2},{"$f":"IF(Pruefung!$I$139=0,-2,(IF(Pruefung!$I$139=1,-3,(IF(Pruefung!$I$139>1,Pruefung!$G$139)))))","v":-2},{"$f":"IF(Grunddaten!$B76<1,\"Nichtstarter\",(IF(Pruefung!$G140>998,\"Ausg.\",(IF(Pruefung!$Q140>1,Pruefung!$G140,Pruefung!S136)))))","v":"Nichtstarter"},{"$f":"IF(Grunddaten!$B76<1,\"Nichtstarter\",(IF(Pruefung!$G140>998,\"Ausg.\",(IF(Pruefung!$Q140>0,Pruefung!$S140,0)))))","v":"Nichtstarter"},{"$f":"IF(Pruefung!$Q140>1,Pruefung!$I140,Pruefung!T140)","v":0},{"$f":"IF(Pruefung!$Q140>0,Pruefung!$T140,0)","v":0},9999,0,9999,0]
[{"$f":"IF(D27=\"Nichtstarter\",\"\",IF(G27=0,IF(AND(D27=D26,E27=E26),A26,18),IF(G27>0,IF(AND(F27=F26,G27=G26),A26,18))))","v":""},{"$f":"Pruefung!A142","v":18},{"$f":"IF(D27=\"Nichtstarter\",\"\",Pruefung!C142)","v":""},"Nichtstarter",0,{"$f":"IF(D27=\"Nichtstarter\",\"+++\",IF(D27=\"Ausg.\",\"***\",IF(Pruefung!P148<0.1,\"---\",IF(Pruefung!O148>998,999,Pruefung!O148))))","v":"+++"},{"$f":"Pruefung!P148","v":0},{"$f":"IF(Pruefung!$I$144=0,-2,(IF(Pruefung!$I$144=1,-3,(IF(Pruefung!$I$144>1,Pruefung!$G$144)))))","v":-2},{"$f":"IF(Pruefung!$I$145=0,-2,(IF(Pruefung!$I$145=1,-3,(IF(Pruefung!$I$145>1,Pruefung!$G$145)))))","v":-2},{"$f":"IF(Pruefung!$I$146=0,-2,(IF(Pruefung!$I$146=1,-3,(IF(Pruefung!$I$146>1,Pruefung!$G$146)))))","v":-2},{"$f":"IF(Pruefung!$I$147=0,-2,(IF(Pruefung!$I$147=1,-3,(IF(Pruefung!$I$147>1,Pruefung!$G$147)))))","v":-2},{"$f":"IF(Grunddaten!$B80<1,\"Nichtstarter\",(IF(Pruefung!$G148>998,\"Ausg.\",(IF(Pruefung!$Q148>1,Pruefung!$G148,Pruefung!S144)))))","v":"Nichtstarter"},{"$f":"IF(Grunddaten!$B80<1,\"Nichtstarter\",(IF(Pruefung!$G148>998,\"Ausg.\",(IF(Pruefung!$Q148>0,Pruefung!$S148,0)))))","v":"Nichtstarter"},{"$f":"IF(Pruefung!$Q148>1,Pruefung!$I148,Pruefung!T148)","v":0},{"$f":"IF(Pruefung!$Q148>0,Pruefung!$T148,0)","v":0},9999,0,9999,0]
[{"$f":"IF(D28=\"Nichtstarter\",\"\",IF(G28=0,IF(AND(D28=D27,E28=E27),A27,19),IF(G28>0,IF(AND(F28=F27,G28=G27),A27,19))))","v":""},{"$f":"Pruefung!A150","v":19},{"$f":"IF(D28=\"Nichtstarter\",\"\",Pruefung!C150)","v":""},"Nichtstarter",0,{"$f":"IF(D28=\"Nichtstarter\",\"+++\",IF(D28=\"Ausg.\",\"***\",IF(Pruefung!P156<0.1,\"---\",IF(Pruefung!O156>998,999,Pruefung!O156))))","v":"+++"},{"$f":"Pruefung!P156","v":0},{"$f":"IF(Pruefung!$I$152=0,-2,(IF(Pruefung!$I$152=1,-3,(IF(Pruefung!$I$152>1,Pruefung!$G$152)))))","v":-2},{"$f":"IF(Pruefung!$I$153=0,-2,(IF(Pruefung!$I$153=1,-3,(IF(Pruefung!$I$153>1,Pruefung!$G$153)))))","v":-2},{"$f":"IF(Pruefung!$I$154=0,-2,(IF(Pruefung!$I$154=1,-3,(IF(Pruefung!$I$154>1,Pruefung!$G$154)))))","v":-2},{"$f":"IF(Pruefung!$I$155=0,-2,(IF(Pruefung!$I$155=1,-3,(IF(Pruefung!$I$155>1,Pruefung!$G$155)))))","v":-2},{"$f":"IF(Grunddaten!$B84<1,\"Nichtstarter\",(IF(Pruefung!$G156>998,\"Ausg.\",(IF(Pruefung!$Q156>1,Pruefung!$G156,Pruefung!S152)))))","v":"Nichtstarter"},{"$f":"IF(Grunddaten!$B84<1,\"Nichtstarter\",(IF(Pruefung!$G156>998,\"Ausg.\",(IF(Pruefung!$Q156>0,Pruefung!$S156,0)))))","v":"Nichtstarter"},{"$f":"IF(Pruefung!$Q156>1,Pruefung!$I156,Pruefung!T156)","v":0},{"$f":"IF(Pruefung!$Q156>0,Pruefung!$T156,0)","v":0},9999,0,9999,0]
[{"$f":"IF(D29=\"Nichtstarter\",\"\",IF(G29=0,IF(AND(D29=D28,E29=E28),A28,20),IF(G29>0,IF(AND(F29=F28,G29=G28),A28,20))))","v":""},{"$f":"Pruefung!A158","v":20},{"$f":"IF(D29=\"Nichtstarter\",\"\",Pruefung!C158)","v":""},"Nichtstarter",0,{"$f":"IF(D29=\"Nichtstarter\",\"+++\",IF(D29=\"Ausg.\",\"***\",IF(Pruefung!P164<0.1,\"---\",IF(Pruefung!O164>998,999,Pruefung!O164))))","v":"+++"},{"$f":"Pruefung!P164","v":0},{"$f":"IF(Pruefung!$I$160=0,-2,(IF(Pruefung!$I$160=1,-3,(IF(Pruefung!$I$160>1,Pruefung!$G$160)))))","v":-2},{"$f":"IF(Pruefung!$I$161=0,-2,(IF(Pruefung!$I$161=1,-3,(IF(Pruefung!$I$161>1,Pruefung!$G$161)))))","v":-2},{"$f":"IF(Pruefung!$I$162=0,-2,(IF(Pruefung!$I$162=1,-3,(IF(Pruefung!$I$162>1,Pruefung!$G$162)))))","v":-2},{"$f":"IF(Pruefung!$I$163=0,-2,(IF(Pruefung!$I$163=1,-3,(IF(Pruefung!$I$163>1,Pruefung!$G$163)))))","v":-2},{"$f":"IF(Grunddaten!$B88<1,\"Nichtstarter\",(IF(Pruefung!$G164>998,\"Ausg.\",(IF(Pruefung!$Q164>1,Pruefung!$G164,Pruefung!S160)))))","v":"Nichtstarter"},{"$f":"IF(Grunddaten!$B88<1,\"Nichtstarter\",(IF(Pruefung!$G164>998,\"Ausg.\",(IF(Pruefung!$Q164>0,Pruefung!$S164,0)))))","v":"Nichtstarter"},{"$f":"IF(Pruefung!$Q164>1,Pruefung!$I164,Pruefung!T164)","v":0},{"$f":"IF(Pruefung!$Q164>0,Pruefung!$T164,0)","v":0},9999,0,9999,0]

{"sheet":"Schlussrangliste","index":4,"n_rows":41,"n_cols":42,"rows_kept":41,"cut":false,"hidden":false,"merged":[[7,3,7,4],[7,13,7,14],[7,11,7,12],[7,9,7,10],[7,7,7,8],[7,5,7,6],[3,0,3,15],[0,0,0,15],[1,0,1,15],[2,0,2,15],[5,0,5,15]]}
[{"$f":"Pruefung!A1","v":"Pferdesporttage"}]
[{"$f":"Pruefung!A2","v":"OKV Vereins-Cup"}]
[{"$f":"Pruefung!A3","v":"Preis der…"}]
[{"$f":"Pruefung!A4","v":"Dieses Dokument wurde erstellt von David Stadelmann - 076 561 41 21"}]
[]
["Zwischen- oder Schlussrangliste"]
[]
[null,null,null,"Aktuelle Quali",null,"Quali",null,"Quali",null,"Quali",null,"Quali",null,"Quali",null,"Total Pkt."]
[null,"Rang","Equipe","Rang","Pkt.","Rang","Pkt.","Rang","Pkt.","Rang","Pkt.","Rang","Pkt.","Rang","Pkt."]
[null,1,{"$f":"IF(Grunddaten!D12=\"100\",\"\",Grunddaten!D12)","v":""},{"$f":"IF($C10=Pruefungsrangliste!$C$10,Pruefungsrangliste!$A$10,IF($C10=Pruefungsrangliste!$C$11,Pruefungsrangliste!$A$11,IF($C10=Pruefungsrangliste!$C$12,Pruefungsrangliste!$A$12,IF($C10=Pruefungsrangliste!$C$13,Pruefungsrangliste!$A$13,IF($C10=Pruefungsrangliste!$C$14,Pruefungsrangliste!$A$14,IF($C10=Pruefungsrangliste!$C$15,Pruefungsrangliste!$A$15,IF($C10=Pruefungsrangliste!$C$16,Pruefungsrangliste!$A$16,IF($C10=Pruefungsrangliste!$C$17,Pruefungsrangliste!$A$17,IF($C10=Pruefungsrangliste!$C$18,Pruefungsrangliste!$A$18,IF($C10=Pruefungsrangliste!$C$19,Pruefungsrangliste!$A$19,IF($C10=Pruefungsrangliste!$C$20,Pruefungsrangliste!$A$20,IF($C10=Pruefungsrangliste!$C$21,Pruefungsrangliste!$A$21,IF($C10=Pruefungsrangliste!$C$22,Pruefungsrangliste!$A$22,IF($C10=Pruefungsrangliste!$C$23,Pruefungsrangliste!$A$23,IF($C10=Pruefungsrangliste!$C$24,Pruefungsrangliste!$A$24,IF($C10=Pruefungsrangliste!$C$25,Pruefungsrangliste!$A$25,IF($C10=Pruefungsrangliste!$C$26,Pruefungsrangliste!$A$26,IF($C10=Pruefungsrangliste!$C$27,Pruefungsrangliste!$A$27,IF($C10=Pruefungsrangliste!$C$28,Pruefungsrangliste!$A$28,IF($C10=Pruefungsrangliste!$C$29,Pruefungsrangliste!$A$29,\"\"))))))))))))))))))))","v":""},{"$f":"IF(D10=1,E$31,IF(D10=2,E$32,IF(D10=3,E$33,IF(D10=4,E$34,IF(D10=5,E$35,IF(D10=6,E$36,IF(D10=7,E$37,IF(D10=8,E$38,IF(D10=9,E$39,IF(D10=10,E$40,IF(D10=11,E$41,IF(D10=12,E$41,IF(D10=13,E$41,IF(D10=14,E$41,IF(D10=15,E$41,IF(D10=16,E$41,IF(D10=17,E$41,IF(D10=18,E$41,IF(D10=19,E$41,IF(D10=20,E$41,IF(D10=\"\",0,\"0\")))))))))))))))))))))","v":0},null,{"$f":"IF(F10=1,G$31,IF(F10=2,G$32,IF(F10=3,G$33,IF(F10=4,G$34,IF(F10=5,G$35,IF(F10=6,G$36,IF(F10=7,G$37,IF(F10=8,G$38,IF(F10=9,G$39,IF(F10=10,G$40,IF(F10=11,G$41,IF(F10=12,G$41,IF(F10=13,G$41,IF(F10=14,G$41,IF(F10=15,G$41,IF(F10=16,G$41,IF(F10=17,G$41,IF(F10=18,G$41,IF(F10=19,G$41,IF(F10=20,G$41,IF(F10=\"\",0,\"0\")))))))))))))))))))))","v":0},null,{"$f":"IF(H10=1,I$31,IF(H10=2,I$32,IF(H10=3,I$33,IF(H10=4,I$34,IF(H10=5,I$35,IF(H10=6,I$36,IF(H10=7,I$37,IF(H10=8,I$38,IF(H10=9,I$39,IF(H10=10,I$40,IF(H10=11,I$41,IF(H10=12,I$41,IF(H10=13,I$41,IF(H10=14,I$41,IF(H10=15,I$41,IF(H10=16,I$41,IF(H10=17,I$41,IF(H10=18,I$41,IF(H10=19,I$41,IF(H10=20,I$41,IF(H10=\"\",0,\"0\")))))))))))))))))))))","v":0},null,{"$f":"IF(J10=1,K$31,IF(J10=2,K$32,IF(J10=3,K$33,IF(J10=4,K$34,IF(J10=5,K$35,IF(J10=6,K$36,IF(J10=7,K$37,IF(J10=8,K$38,IF(J10=9,K$39,IF(J10=10,K$40,IF(J10=11,K$41,IF(J10=12,K$41,IF(J10=13,K$41,IF(J10=14,K$41,IF(J10=15,K$41,IF(J10=16,K$41,IF(J10=17,K$41,IF(J10=18,K$41,IF(J10=19,K$41,IF(J10=20,K$41,IF(J10=\"\",0,\"0\")))))))))))))))))))))","v":0},null,{"$f":"IF(L10=1,M$31,IF(L10=2,M$32,IF(L10=3,M$33,IF(L10=4,M$34,IF(L10=5,M$35,IF(L10=6,M$36,IF(L10=7,M$37,IF(L10=8,M$38,IF(L10=9,M$39,IF(L10=10,M$40,IF(L10=11,M$41,IF(L10=12,M$41,IF(L10=13,M$41,IF(L10=14,M$41,IF(L10=15,M$41,IF(L10=16,M$41,IF(L10=17,M$41,IF(L10=18,M$41,IF(L10=19,M$41,IF(L10=20,M$41,IF(L10=\"\",0,\"0\")))))))))))))))))))))","v":0},null,{"$f":"IF(N10=1,O$31,IF(N10=2,O$32,IF(N10=3,O$33,IF(N10=4,O$34,IF(N10=5,O$35,IF(N10=6,O$36,IF(N10=7,O$37,IF(N10=8,O$38,IF(N10=9,O$39,IF(N10=10,O$40,IF(N10=11,O$41,IF(N10=12,O$41,IF(N10=13,O$41,IF(N10=14,O$41,IF(N10=15,O$41,IF(N10=16,O$41,IF(N10=17,O$41,IF(N10=18,O$41,IF(N10=19,O$41,IF(N10=20,O$41,IF(N10=\"\",0,\"0\")))))))))))))))))))))","v":0},{"$f":"E10+G10+I10+K10+M10+O10","v":0},{"$f":"D10","v":""},{"$f":"F10","v":0},{"$f":"H10","v":0},{"$f":"J10","v":0},{"$f":"L10","v":0},{"$f":"N10","v":0},{"$f":"COUNTIF($Q10:$V10,\"1\")","v":0},{"$f":"COUNTIF($Q10:$V10,\"2\")","v":0},{"$f":"COUNTIF($Q10:$V10,\"3\")","v":0},{"$f":"COUNTIF($Q10:$V10,\"4\")","v":0},{"$f":"COUNTIF($Q10:$V10,\"5\")","v":0},{"$f":"COUNTIF($Q10:$V10,\"6\")","v":0},{"$f":"COUNTIF($Q10:$V10,\"7\")","v":0},{"$f":"COUNTIF($Q10:$V10,\"8\")","v":0},{"$f":"COUNTIF($Q10:$V10,\"9\")","v":0},{"$f":"COUNTIF($Q10:$V10,\"10\")","v":0},{"$f":"COUNTIF($Q10:$V10,\"11\")","v":0},{"$f":"COUNTIF($Q10:$V10,\"12\")","v":0},{"$f":"COUNTIF($Q10:$V10,\"13\")","v":0},{"$f":"COUNTIF($Q10:$V10,\"14\")","v":0},{"$f":"COUNTIF($Q10:$V10,\"15\")","v":0},{"$f":"COUNTIF($Q10:$V10,\"16\")","v":0},{"$f":"COUNTIF($Q10:$V10,\"17\")","v":0},{"$f":"COUNTIF($Q10:$V10,\"18\")","v":0},{"$f":"COUNTIF($Q10:$V10,\"19\")","v":0},{"$f":"COUNTIF($Q10:$V10,\"20\")","v":0}]
[null,2,{"$f":"IF(Grunddaten!D16=\"104\",\"\",Grunddaten!D16)","v":""},{"$f":"IF($C11=Pruefungsrangliste!$C$10,Pruefungsrangliste!$A$10,IF($C11=Pruefungsrangliste!$C$11,Pruefungsrangliste!$A$11,IF($C11=Pruefungsrangliste!$C$12,Pruefungsrangliste!$A$12,IF($C11=Pruefungsrangliste!$C$13,Pruefungsrangliste!$A$13,IF($C11=Pruefungsrangliste!$C$14,Pruefungsrangliste!$A$14,IF($C11=Pruefungsrangliste!$C$15,Pruefungsrangliste!$A$15,IF($C11=Pruefungsrangliste!$C$16,Pruefungsrangliste!$A$16,IF($C11=Pruefungsrangliste!$C$17,Pruefungsrangliste!$A$17,IF($C11=Pruefungsrangliste!$C$18,Pruefungsrangliste!$A$18,IF($C11=Pruefungsrangliste!$C$19,Pruefungsrangliste!$A$19,IF($C11=Pruefungsrangliste!$C$20,Pruefungsrangliste!$A$20,IF($C11=Pruefungsrangliste!$C$21,Pruefungsrangliste!$A$21,IF($C11=Pruefungsrangliste!$C$22,Pruefungsrangliste!$A$22,IF($C11=Pruefungsrangliste!$C$23,Pruefungsrangliste!$A$23,IF($C11=Pruefungsrangliste!$C$24,Pruefungsrangliste!$A$24,IF($C11=Pruefungsrangliste!$C$25,Pruefungsrangliste!$A$25,IF($C11=Pruefungsrangliste!$C$26,Pruefungsrangliste!$A$26,IF($C11=Pruefungsrangliste!$C$27,Pruefungsrangliste!$A$27,IF($C11=Pruefungsrangliste!$C$28,Pruefungsrangliste!$A$28,IF($C11=Pruefungsrangliste!$C$29,Pruefungsrangliste!$A$29,\"\"))))))))))))))))))))","v":""},{"$f":"IF(D11=1,E$31,IF(D11=2,E$32,IF(D11=3,E$33,IF(D11=4,E$34,IF(D11=5,E$35,IF(D11=6,E$36,IF(D11=7,E$37,IF(D11=8,E$38,IF(D11=9,E$39,IF(D11=10,E$40,IF(D11=11,E$41,IF(D11=12,E$41,IF(D11=13,E$41,IF(D11=14,E$41,IF(D11=15,E$41,IF(D11=16,E$41,IF(D11=17,E$41,IF(D11=18,E$41,IF(D11=19,E$41,IF(D11=20,E$41,IF(D11=\"\",0,\"0\")))))))))))))))))))))","v":0},null,{"$f":"IF(F11=1,G$31,IF(F11=2,G$32,IF(F11=3,G$33,IF(F11=4,G$34,IF(F11=5,G$35,IF(F11=6,G$36,IF(F11=7,G$37,IF(F11=8,G$38,IF(F11=9,G$39,IF(F11=10,G$40,IF(F11=11,G$41,IF(F11=12,G$41,IF(F11=13,G$41,IF(F11=14,G$41,IF(F11=15,G$41,IF(F11=16,G$41,IF(F11=17,G$41,IF(F11=18,G$41,IF(F11=19,G$41,IF(F11=20,G$41,IF(F11=\"\",0,\"0\")))))))))))))))))))))","v":0},null,0,null,{"$f":"IF(J11=1,K$31,IF(J11=2,K$32,IF(J11=3,K$33,IF(J11=4,K$34,IF(J11=5,K$35,IF(J11=6,K$36,IF(J11=7,K$37,IF(J11=8,K$38,IF(J11=9,K$39,IF(J11=10,K$40,IF(J11=11,K$41,IF(J11=12,K$41,IF(J11=13,K$41,IF(J11=14,K$41,IF(J11=15,K$41,IF(J11=16,K$41,IF(J11=17,K$41,IF(J11=18,K$41,IF(J11=19,K$41,IF(J11=20,K$41,IF(J11=\"\",0,\"0\")))))))))))))))))))))","v":0},null,{"$f":"IF(L11=1,M$31,IF(L11=2,M$32,IF(L11=3,M$33,IF(L11=4,M$34,IF(L11=5,M$35,IF(L11=6,M$36,IF(L11=7,M$37,IF(L11=8,M$38,IF(L11=9,M$39,IF(L11=10,M$40,IF(L11=11,M$41,IF(L11=12,M$41,IF(L11=13,M$41,IF(L11=14,M$41,IF(L11=15,M$41,IF(L11=16,M$41,IF(L11=17,M$41,IF(L11=18,M$41,IF(L11=19,M$41,IF(L11=20,M$41,IF(L11=\"\",0,\"0\")))))))))))))))))))))","v":0},null,{"$f":"IF(N11=1,O$31,IF(N11=2,O$32,IF(N11=3,O$33,IF(N11=4,O$34,IF(N11=5,O$35,IF(N11=6,O$36,IF(N11=7,O$37,IF(N11=8,O$38,IF(N11=9,O$39,IF(N11=10,O$40,IF(N11=11,O$41,IF(N11=12,O$41,IF(N11=13,O$41,IF(N11=14,O$41,IF(N11=15,O$41,IF(N11=16,O$41,IF(N11=17,O$41,IF(N11=18,O$41,IF(N11=19,O$41,IF(N11=20,O$41,IF(N11=\"\",0,\"0\")))))))))))))))))))))","v":0},0,"",0,0,0,0,0,0,0,0,0,0,0,0,0,0,0,0,0,0,0,0,0,0,0,0,0]
[null,3,{"$f":"IF(Grunddaten!D20=\"108\",\"\",Grunddaten!D20)","v":""},{"$f":"IF($C12=Pruefungsrangliste!$C$10,Pruefungsrangliste!$A$10,IF($C12=Pruefungsrangliste!$C$11,Pruefungsrangliste!$A$11,IF($C12=Pruefungsrangliste!$C$12,Pruefungsrangliste!$A$12,IF($C12=Pruefungsrangliste!$C$13,Pruefungsrangliste!$A$13,IF($C12=Pruefungsrangliste!$C$14,Pruefungsrangliste!$A$14,IF($C12=Pruefungsrangliste!$C$15,Pruefungsrangliste!$A$15,IF($C12=Pruefungsrangliste!$C$16,Pruefungsrangliste!$A$16,IF($C12=Pruefungsrangliste!$C$17,Pruefungsrangliste!$A$17,IF($C12=Pruefungsrangliste!$C$18,Pruefungsrangliste!$A$18,IF($C12=Pruefungsrangliste!$C$19,Pruefungsrangliste!$A$19,IF($C12=Pruefungsrangliste!$C$20,Pruefungsrangliste!$A$20,IF($C12=Pruefungsrangliste!$C$21,Pruefungsrangliste!$A$21,IF($C12=Pruefungsrangliste!$C$22,Pruefungsrangliste!$A$22,IF($C12=Pruefungsrangliste!$C$23,Pruefungsrangliste!$A$23,IF($C12=Pruefungsrangliste!$C$24,Pruefungsrangliste!$A$24,IF($C12=Pruefungsrangliste!$C$25,Pruefungsrangliste!$A$25,IF($C12=Pruefungsrangliste!$C$26,Pruefungsrangliste!$A$26,IF($C12=Pruefungsrangliste!$C$27,Pruefungsrangliste!$A$27,IF($C12=Pruefungsrangliste!$C$28,Pruefungsrangliste!$A$28,IF($C12=Pruefungsrangliste!$C$29,Pruefungsrangliste!$A$29,\"\"))))))))))))))))))))","v":""},0,null,0,null,0,null,{"$f":"IF(J12=1,K$31,IF(J12=2,K$32,IF(J12=3,K$33,IF(J12=4,K$34,IF(J12=5,K$35,IF(J12=6,K$36,IF(J12=7,K$37,IF(J12=8,K$38,IF(J12=9,K$39,IF(J12=10,K$40,IF(J12=11,K$41,IF(J12=12,K$41,IF(J12=13,K$41,IF(J12=14,K$41,IF(J12=15,K$41,IF(J12=16,K$41,IF(J12=17,K$41,IF(J12=18,K$41,IF(J12=19,K$41,IF(J12=20,K$41,IF(J12=\"\",0,\"0\")))))))))))))))))))))","v":0},null,{"$f":"IF(L12=1,M$31,IF(L12=2,M$32,IF(L12=3,M$33,IF(L12=4,M$34,IF(L12=5,M$35,IF(L12=6,M$36,IF(L12=7,M$37,IF(L12=8,M$38,IF(L12=9,M$39,IF(L12=10,M$40,IF(L12=11,M$41,IF(L12=12,M$41,IF(L12=13,M$41,IF(L12=14,M$41,IF(L12=15,M$41,IF(L12=16,M$41,IF(L12=17,M$41,IF(L12=18,M$41,IF(L12=19,M$41,IF(L12=20,M$41,IF(L12=\"\",0,\"0\")))))))))))))))))))))","v":0},null,{"$f":"IF(N12=1,O$31,IF(N12=2,O$32,IF(N12=3,O$33,IF(N12=4,O$34,IF(N12=5,O$35,IF(N12=6,O$36,IF(N12=7,O$37,IF(N12=8,O$38,IF(N12=9,O$39,IF(N12=10,O$40,IF(N12=11,O$41,IF(N12=12,O$41,IF(N12=13,O$41,IF(N12=14,O$41,IF(N12=15,O$41,IF(N12=16,O$41,IF(N12=17,O$41,IF(N12=18,O$41,IF(N12=19,O$41,IF(N12=20,O$41,IF(N12=\"\",0,\"0\")))))))))))))))))))))","v":0},0,"",0,0,0,0,0,0,0,0,0,0,0,0,0,0,0,0,0,0,0,0,0,0,0,0,0]
[null,4,{"$f":"IF(Grunddaten!D40=\"128\",\"\",Grunddaten!D40)","v":""},{"$f":"IF($C13=Pruefungsrangliste!$C$10,Pruefungsrangliste!$A$10,IF($C13=Pruefungsrangliste!$C$11,Pruefungsrangliste!$A$11,IF($C13=Pruefungsrangliste!$C$12,Pruefungsrangliste!$A$12,IF($C13=Pruefungsrangliste!$C$13,Pruefungsrangliste!$A$13,IF($C13=Pruefungsrangliste!$C$14,Pruefungsrangliste!$A$14,IF($C13=Pruefungsrangliste!$C$15,Pruefungsrangliste!$A$15,IF($C13=Pruefungsrangliste!$C$16,Pruefungsrangliste!$A$16,IF($C13=Pruefungsrangliste!$C$17,Pruefungsrangliste!$A$17,IF($C13=Pruefungsrangliste!$C$18,Pruefungsrangliste!$A$18,IF($C13=Pruefungsrangliste!$C$19,Pruefungsrangliste!$A$19,IF($C13=Pruefungsrangliste!$C$20,Pruefungsrangliste!$A$20,IF($C13=Pruefungsrangliste!$C$21,Pruefungsrangliste!$A$21,IF($C13=Pruefungsrangliste!$C$22,Pruefungsrangliste!$A$22,IF($C13=Pruefungsrangliste!$C$23,Pruefungsrangliste!$A$23,IF($C13=Pruefungsrangliste!$C$24,Pruefungsrangliste!$A$24,IF($C13=Pruefungsrangliste!$C$25,Pruefungsrangliste!$A$25,IF($C13=Pruefungsrangliste!$C$26,Pruefungsrangliste!$A$26,IF($C13=Pruefungsrangliste!$C$27,Pruefungsrangliste!$A$27,IF($C13=Pruefungsrangliste!$C$28,Pruefungsrangliste!$A$28,IF($C13=Pruefungsrangliste!$C$29,Pruefungsrangliste!$A$29,\"\"))))))))))))))))))))","v":""},0,null,0,null,0,null,{"$f":"IF(J13=1,K$31,IF(J13=2,K$32,IF(J13=3,K$33,IF(J13=4,K$34,IF(J13=5,K$35,IF(J13=6,K$36,IF(J13=7,K$37,IF(J13=8,K$38,IF(J13=9,K$39,IF(J13=10,K$40,IF(J13=11,K$41,IF(J13=12,K$41,IF(J13=13,K$41,IF(J13=14,K$41,IF(J13=15,K$41,IF(J13=16,K$41,IF(J13=17,K$41,IF(J13=18,K$41,IF(J13=19,K$41,IF(J13=20,K$41,IF(J13=\"\",0,\"0\")))))))))))))))))))))","v":0},null,{"$f":"IF(L13=1,M$31,IF(L13=2,M$32,IF(L13=3,M$33,IF(L13=4,M$34,IF(L13=5,M$35,IF(L13=6,M$36,IF(L13=7,M$37,IF(L13=8,M$38,IF(L13=9,M$39,IF(L13=10,M$40,IF(L13=11,M$41,IF(L13=12,M$41,IF(L13=13,M$41,IF(L13=14,M$41,IF(L13=15,M$41,IF(L13=16,M$41,IF(L13=17,M$41,IF(L13=18,M$41,IF(L13=19,M$41,IF(L13=20,M$41,IF(L13=\"\",0,\"0\")))))))))))))))))))))","v":0},null,{"$f":"IF(N13=1,O$31,IF(N13=2,O$32,IF(N13=3,O$33,IF(N13=4,O$34,IF(N13=5,O$35,IF(N13=6,O$36,IF(N13=7,O$37,IF(N13=8,O$38,IF(N13=9,O$39,IF(N13=10,O$40,IF(N13=11,O$41,IF(N13=12,O$41,IF(N13=13,O$41,IF(N13=14,O$41,IF(N13=15,O$41,IF(N13=16,O$41,IF(N13=17,O$41,IF(N13=18,O$41,IF(N13=19,O$41,IF(N13=20,O$41,IF(N13=\"\",0,\"0\")))))))))))))))))))))","v":0},0,"",0,0,0,0,0,0,0,0,0,0,0,0,0,0,0,0,0,0,0,0,0,0,0,0,0]
[null,5,{"$f":"IF(Grunddaten!D64=\"152\",\"\",Grunddaten!D64)","v":""},{"$f":"IF($C14=Pruefungsrangliste!$C$10,Pruefungsrangliste!$A$10,IF($C14=Pruefungsrangliste!$C$11,Pruefungsrangliste!$A$11,IF($C14=Pruefungsrangliste!$C$12,Pruefungsrangliste!$A$12,IF($C14=Pruefungsrangliste!$C$13,Pruefungsrangliste!$A$13,IF($C14=Pruefungsrangliste!$C$14,Pruefungsrangliste!$A$14,IF($C14=Pruefungsrangliste!$C$15,Pruefungsrangliste!$A$15,IF($C14=Pruefungsrangliste!$C$16,Pruefungsrangliste!$A$16,IF($C14=Pruefungsrangliste!$C$17,Pruefungsrangliste!$A$17,IF($C14=Pruefungsrangliste!$C$18,Pruefungsrangliste!$A$18,IF($C14=Pruefungsrangliste!$C$19,Pruefungsrangliste!$A$19,IF($C14=Pruefungsrangliste!$C$20,Pruefungsrangliste!$A$20,IF($C14=Pruefungsrangliste!$C$21,Pruefungsrangliste!$A$21,IF($C14=Pruefungsrangliste!$C$22,Pruefungsrangliste!$A$22,IF($C14=Pruefungsrangliste!$C$23,Pruefungsrangliste!$A$23,IF($C14=Pruefungsrangliste!$C$24,Pruefungsrangliste!$A$24,IF($C14=Pruefungsrangliste!$C$25,Pruefungsrangliste!$A$25,IF($C14=Pruefungsrangliste!$C$26,Pruefungsrangliste!$A$26,IF($C14=Pruefungsrangliste!$C$27,Pruefungsrangliste!$A$27,IF($C14=Pruefungsrangliste!$C$28,Pruefungsrangliste!$A$28,IF($C14=Pruefungsrangliste!$C$29,Pruefungsrangliste!$A$29,\"\"))))))))))))))))))))","v":""},0,null,0,null,0,null,{"$f":"IF(J14=1,K$31,IF(J14=2,K$32,IF(J14=3,K$33,IF(J14=4,K$34,IF(J14=5,K$35,IF(J14=6,K$36,IF(J14=7,K$37,IF(J14=8,K$38,IF(J14=9,K$39,IF(J14=10,K$40,IF(J14=11,K$41,IF(J14=12,K$41,IF(J14=13,K$41,IF(J14=14,K$41,IF(J14=15,K$41,IF(J14=16,K$41,IF(J14=17,K$41,IF(J14=18,K$41,IF(J14=19,K$41,IF(J14=20,K$41,IF(J14=\"\",0,\"0\")))))))))))))))))))))","v":0},null,{"$f":"IF(L14=1,M$31,IF(L14=2,M$32,IF(L14=3,M$33,IF(L14=4,M$34,IF(L14=5,M$35,IF(L14=6,M$36,IF(L14=7,M$37,IF(L14=8,M$38,IF(L14=9,M$39,IF(L14=10,M$40,IF(L14=11,M$41,IF(L14=12,M$41,IF(L14=13,M$41,IF(L14=14,M$41,IF(L14=15,M$41,IF(L14=16,M$41,IF(L14=17,M$41,IF(L14=18,M$41,IF(L14=19,M$41,IF(L14=20,M$41,IF(L14=\"\",0,\"0\")))))))))))))))))))))","v":0},null,{"$f":"IF(N14=1,O$31,IF(N14=2,O$32,IF(N14=3,O$33,IF(N14=4,O$34,IF(N14=5,O$35,IF(N14=6,O$36,IF(N14=7,O$37,IF(N14=8,O$38,IF(N14=9,O$39,IF(N14=10,O$40,IF(N14=11,O$41,IF(N14=12,O$41,IF(N14=13,O$41,IF(N14=14,O$41,IF(N14=15,O$41,IF(N14=16,O$41,IF(N14=17,O$41,IF(N14=18,O$41,IF(N14=19,O$41,IF(N14=20,O$41,IF(N14=\"\",0,\"0\")))))))))))))))))))))","v":0},0,"",0,0,0,0,0,0,0,0,0,0,0,0,0,0,0,0,0,0,0,0,0,0,0,0,0]
[null,6,{"$f":"IF(Grunddaten!D44=\"132\",\"\",Grunddaten!D44)","v":""},{"$f":"IF($C15=Pruefungsrangliste!$C$10,Pruefungsrangliste!$A$10,IF($C15=Pruefungsrangliste!$C$11,Pruefungsrangliste!$A$11,IF($C15=Pruefungsrangliste!$C$12,Pruefungsrangliste!$A$12,IF($C15=Pruefungsrangliste!$C$13,Pruefungsrangliste!$A$13,IF($C15=Pruefungsrangliste!$C$14,Pruefungsrangliste!$A$14,IF($C15=Pruefungsrangliste!$C$15,Pruefungsrangliste!$A$15,IF($C15=Pruefungsrangliste!$C$16,Pruefungsrangliste!$A$16,IF($C15=Pruefungsrangliste!$C$17,Pruefungsrangliste!$A$17,IF($C15=Pruefungsrangliste!$C$18,Pruefungsrangliste!$A$18,IF($C15=Pruefungsrangliste!$C$19,Pruefungsrangliste!$A$19,IF($C15=Pruefungsrangliste!$C$20,Pruefungsrangliste!$A$20,IF($C15=Pruefungsrangliste!$C$21,Pruefungsrangliste!$A$21,IF($C15=Pruefungsrangliste!$C$22,Pruefungsrangliste!$A$22,IF($C15=Pruefungsrangliste!$C$23,Pruefungsrangliste!$A$23,IF($C15=Pruefungsrangliste!$C$24,Pruefungsrangliste!$A$24,IF($C15=Pruefungsrangliste!$C$25,Pruefungsrangliste!$A$25,IF($C15=Pruefungsrangliste!$C$26,Pruefungsrangliste!$A$26,IF($C15=Pruefungsrangliste!$C$27,Pruefungsrangliste!$A$27,IF($C15=Pruefungsrangliste!$C$28,Pruefungsrangliste!$A$28,IF($C15=Pruefungsrangliste!$C$29,Pruefungsrangliste!$A$29,\"\"))))))))))))))))))))","v":""},0,null,0,null,0,null,{"$f":"IF(J15=1,K$31,IF(J15=2,K$32,IF(J15=3,K$33,IF(J15=4,K$34,IF(J15=5,K$35,IF(J15=6,K$36,IF(J15=7,K$37,IF(J15=8,K$38,IF(J15=9,K$39,IF(J15=10,K$40,IF(J15=11,K$41,IF(J15=12,K$41,IF(J15=13,K$41,IF(J15=14,K$41,IF(J15=15,K$41,IF(J15=16,K$41,IF(J15=17,K$41,IF(J15=18,K$41,IF(J15=19,K$41,IF(J15=20,K$41,IF(J15=\"\",0,\"0\")))))))))))))))))))))","v":0},null,{"$f":"IF(L15=1,M$31,IF(L15=2,M$32,IF(L15=3,M$33,IF(L15=4,M$34,IF(L15=5,M$35,IF(L15=6,M$36,IF(L15=7,M$37,IF(L15=8,M$38,IF(L15=9,M$39,IF(L15=10,M$40,IF(L15=11,M$41,IF(L15=12,M$41,IF(L15=13,M$41,IF(L15=14,M$41,IF(L15=15,M$41,IF(L15=16,M$41,IF(L15=17,M$41,IF(L15=18,M$41,IF(L15=19,M$41,IF(L15=20,M$41,IF(L15=\"\",0,\"0\")))))))))))))))))))))","v":0},null,{"$f":"IF(N15=1,O$31,IF(N15=2,O$32,IF(N15=3,O$33,IF(N15=4,O$34,IF(N15=5,O$35,IF(N15=6,O$36,IF(N15=7,O$37,IF(N15=8,O$38,IF(N15=9,O$39,IF(N15=10,O$40,IF(N15=11,O$41,IF(N15=12,O$41,IF(N15=13,O$41,IF(N15=14,O$41,IF(N15=15,O$41,IF(N15=16,O$41,IF(N15=17,O$41,IF(N15=18,O$41,IF(N15=19,O$41,IF(N15=20,O$41,IF(N15=\"\",0,\"0\")))))))))))))))))))))","v":0},0,"",0,0,0,0,0,0,0,0,0,0,0,0,0,0,0,0,0,0,0,0,0,0,0,0,0]
[null,7,{"$f":"IF(Grunddaten!D48=\"136\",\"\",Grunddaten!D48)","v":""},{"$f":"IF($C16=Pruefungsrangliste!$C$10,Pruefungsrangliste!$A$10,IF($C16=Pruefungsrangliste!$C$11,Pruefungsrangliste!$A$11,IF($C16=Pruefungsrangliste!$C$12,Pruefungsrangliste!$A$12,IF($C16=Pruefungsrangliste!$C$13,Pruefungsrangliste!$A$13,IF($C16=Pruefungsrangliste!$C$14,Pruefungsrangliste!$A$14,IF($C16=Pruefungsrangliste!$C$15,Pruefungsrangliste!$A$15,IF($C16=Pruefungsrangliste!$C$16,Pruefungsrangliste!$A$16,IF($C16=Pruefungsrangliste!$C$17,Pruefungsrangliste!$A$17,IF($C16=Pruefungsrangliste!$C$18,Pruefungsrangliste!$A$18,IF($C16=Pruefungsrangliste!$C$19,Pruefungsrangliste!$A$19,IF($C16=Pruefungsrangliste!$C$20,Pruefungsrangliste!$A$20,IF($C16=Pruefungsrangliste!$C$21,Pruefungsrangliste!$A$21,IF($C16=Pruefungsrangliste!$C$22,Pruefungsrangliste!$A$22,IF($C16=Pruefungsrangliste!$C$23,Pruefungsrangliste!$A$23,IF($C16=Pruefungsrangliste!$C$24,Pruefungsrangliste!$A$24,IF($C16=Pruefungsrangliste!$C$25,Pruefungsrangliste!$A$25,IF($C16=Pruefungsrangliste!$C$26,Pruefungsrangliste!$A$26,IF($C16=Pruefungsrangliste!$C$27,Pruefungsrangliste!$A$27,IF($C16=Pruefungsrangliste!$C$28,Pruefungsrangliste!$A$28,IF($C16=Pruefungsrangliste!$C$29,Pruefungsrangliste!$A$29,\"\"))))))))))))))))))))","v":""},0,null,0,null,0,null,{"$f":"IF(J16=1,K$31,IF(J16=2,K$32,IF(J16=3,K$33,IF(J16=4,K$34,IF(J16=5,K$35,IF(J16=6,K$36,IF(J16=7,K$37,IF(J16=8,K$38,IF(J16=9,K$39,IF(J16=10,K$40,IF(J16=11,K$41,IF(J16=12,K$41,IF(J16=13,K$41,IF(J16=14,K$41,IF(J16=15,K$41,IF(J16=16,K$41,IF(J16=17,K$41,IF(J16=18,K$41,IF(J16=19,K$41,IF(J16=20,K$41,IF(J16=\"\",0,\"0\")))))))))))))))))))))","v":0},null,{"$f":"IF(L16=1,M$31,IF(L16=2,M$32,IF(L16=3,M$33,IF(L16=4,M$34,IF(L16=5,M$35,IF(L16=6,M$36,IF(L16=7,M$37,IF(L16=8,M$38,IF(L16=9,M$39,IF(L16=10,M$40,IF(L16=11,M$41,IF(L16=12,M$41,IF(L16=13,M$41,IF(L16=14,M$41,IF(L16=15,M$41,IF(L16=16,M$41,IF(L16=17,M$41,IF(L16=18,M$41,IF(L16=19,M$41,IF(L16=20,M$41,IF(L16=\"\",0,\"0\")))))))))))))))))))))","v":0},null,{"$f":"IF(N16=1,O$31,IF(N16=2,O$32,IF(N16=3,O$33,IF(N16=4,O$34,IF(N16=5,O$35,IF(N16=6,O$36,IF(N16=7,O$37,IF(N16=8,O$38,IF(N16=9,O$39,IF(N16=10,O$40,IF(N16=11,O$41,IF(N16=12,O$41,IF(N16=13,O$41,IF(N16=14,O$41,IF(N16=15,O$41,IF(N16=16,O$41,IF(N16=17,O$41,IF(N16=18,O$41,IF(N16=19,O$41,IF(N16=20,O$41,IF(N16=\"\",0,\"0\")))))))))))))))))))))","v":0},0,"",0,0,0,0,0,0,0,0,0,0,0,0,0,0,0,0,0,0,0,0,0,0,0,0,0]
[null,8,{"$f":"IF(Grunddaten!D60=\"148\",\"\",Grunddaten!D60)","v":""},{"$f":"IF($C17=Pruefungsrangliste!$C$10,Pruefungsrangliste!$A$10,IF($C17=Pruefungsrangliste!$C$11,Pruefungsrangliste!$A$11,IF($C17=Pruefungsrangliste!$C$12,Pruefungsrangliste!$A$12,IF($C17=Pruefungsrangliste!$C$13,Pruefungsrangliste!$A$13,IF($C17=Pruefungsrangliste!$C$14,Pruefungsrangliste!$A$14,IF($C17=Pruefungsrangliste!$C$15,Pruefungsrangliste!$A$15,IF($C17=Pruefungsrangliste!$C$16,Pruefungsrangliste!$A$16,IF($C17=Pruefungsrangliste!$C$17,Pruefungsrangliste!$A$17,IF($C17=Pruefungsrangliste!$C$18,Pruefungsrangliste!$A$18,IF($C17=Pruefungsrangliste!$C$19,Pruefungsrangliste!$A$19,IF($C17=Pruefungsrangliste!$C$20,Pruefungsrangliste!$A$20,IF($C17=Pruefungsrangliste!$C$21,Pruefungsrangliste!$A$21,IF($C17=Pruefungsrangliste!$C$22,Pruefungsrangliste!$A$22,IF($C17=Pruefungsrangliste!$C$23,Pruefungsrangliste!$A$23,IF($C17=Pruefungsrangliste!$C$24,Pruefungsrangliste!$A$24,IF($C17=Pruefungsrangliste!$C$25,Pruefungsrangliste!$A$25,IF($C17=Pruefungsrangliste!$C$26,Pruefungsrangliste!$A$26,IF($C17=Pruefungsrangliste!$C$27,Pruefungsrangliste!$A$27,IF($C17=Pruefungsrangliste!$C$28,Pruefungsrangliste!$A$28,IF($C17=Pruefungsrangliste!$C$29,Pruefungsrangliste!$A$29,\"\"))))))))))))))))))))","v":""},0,null,0,null,0,null,{"$f":"IF(J17=1,K$31,IF(J17=2,K$32,IF(J17=3,K$33,IF(J17=4,K$34,IF(J17=5,K$35,IF(J17=6,K$36,IF(J17=7,K$37,IF(J17=8,K$38,IF(J17=9,K$39,IF(J17=10,K$40,IF(J17=11,K$41,IF(J17=12,K$41,IF(J17=13,K$41,IF(J17=14,K$41,IF(J17=15,K$41,IF(J17=16,K$41,IF(J17=17,K$41,IF(J17=18,K$41,IF(J17=19,K$41,IF(J17=20,K$41,IF(J17=\"\",0,\"0\")))))))))))))))))))))","v":0},null,{"$f":"IF(L17=1,M$31,IF(L17=2,M$32,IF(L17=3,M$33,IF(L17=4,M$34,IF(L17=5,M$35,IF(L17=6,M$36,IF(L17=7,M$37,IF(L17=8,M$38,IF(L17=9,M$39,IF(L17=10,M$40,IF(L17=11,M$41,IF(L17=12,M$41,IF(L17=13,M$41,IF(L17=14,M$41,IF(L17=15,M$41,IF(L17=16,M$41,IF(L17=17,M$41,IF(L17=18,M$41,IF(L17=19,M$41,IF(L17=20,M$41,IF(L17=\"\",0,\"0\")))))))))))))))))))))","v":0},null,{"$f":"IF(N17=1,O$31,IF(N17=2,O$32,IF(N17=3,O$33,IF(N17=4,O$34,IF(N17=5,O$35,IF(N17=6,O$36,IF(N17=7,O$37,IF(N17=8,O$38,IF(N17=9,O$39,IF(N17=10,O$40,IF(N17=11,O$41,IF(N17=12,O$41,IF(N17=13,O$41,IF(N17=14,O$41,IF(N17=15,O$41,IF(N17=16,O$41,IF(N17=17,O$41,IF(N17=18,O$41,IF(N17=19,O$41,IF(N17=20,O$41,IF(N17=\"\",0,\"0\")))))))))))))))))))))","v":0},0,"",0,0,0,0,0,0,0,0,0,0,0,0,0,0,0,0,0,0,0,0,0,0,0,0,0]
[null,9,{"$f":"IF(Grunddaten!D56=\"144\",\"\",Grunddaten!D56)","v":""},{"$f":"IF($C18=Pruefungsrangliste!$C$10,Pruefungsrangliste!$A$10,IF($C18=Pruefungsrangliste!$C$11,Pruefungsrangliste!$A$11,IF($C18=Pruefungsrangliste!$C$12,Pruefungsrangliste!$A$12,IF($C18=Pruefungsrangliste!$C$13,Pruefungsrangliste!$A$13,IF($C18=Pruefungsrangliste!$C$14,Pruefungsrangliste!$A$14,IF($C18=Pruefungsrangliste!$C$15,Pruefungsrangliste!$A$15,IF($C18=Pruefungsrangliste!$C$16,Pruefungsrangliste!$A$16,IF($C18=Pruefungsrangliste!$C$17,Pruefungsrangliste!$A$17,IF($C18=Pruefungsrangliste!$C$18,Pruefungsrangliste!$A$18,IF($C18=Pruefungsrangliste!$C$19,Pruefungsrangliste!$A$19,IF($C18=Pruefungsrangliste!$C$20,Pruefungsrangliste!$A$20,IF($C18=Pruefungsrangliste!$C$21,Pruefungsrangliste!$A$21,IF($C18=Pruefungsrangliste!$C$22,Pruefungsrangliste!$A$22,IF($C18=Pruefungsrangliste!$C$23,Pruefungsrangliste!$A$23,IF($C18=Pruefungsrangliste!$C$24,Pruefungsrangliste!$A$24,IF($C18=Pruefungsrangliste!$C$25,Pruefungsrangliste!$A$25,IF($C18=Pruefungsrangliste!$C$26,Pruefungsrangliste!$A$26,IF($C18=Pruefungsrangliste!$C$27,Pruefungsrangliste!$A$27,IF($C18=Pruefungsrangliste!$C$28,Pruefungsrangliste!$A$28,IF($C18=Pruefungsrangliste!$C$29,Pruefungsrangliste!$A$29,\"\"))))))))))))))))))))","v":""},0,null,0,null,0,null,{"$f":"IF(J18=1,K$31,IF(J18=2,K$32,IF(J18=3,K$33,IF(J18=4,K$34,IF(J18=5,K$35,IF(J18=6,K$36,IF(J18=7,K$37,IF(J18=8,K$38,IF(J18=9,K$39,IF(J18=10,K$40,IF(J18=11,K$41,IF(J18=12,K$41,IF(J18=13,K$41,IF(J18=14,K$41,IF(J18=15,K$41,IF(J18=16,K$41,IF(J18=17,K$41,IF(J18=18,K$41,IF(J18=19,K$41,IF(J18=20,K$41,IF(J18=\"\",0,\"0\")))))))))))))))))))))","v":0},null,{"$f":"IF(L18=1,M$31,IF(L18=2,M$32,IF(L18=3,M$33,IF(L18=4,M$34,IF(L18=5,M$35,IF(L18=6,M$36,IF(L18=7,M$37,IF(L18=8,M$38,IF(L18=9,M$39,IF(L18=10,M$40,IF(L18=11,M$41,IF(L18=12,M$41,IF(L18=13,M$41,IF(L18=14,M$41,IF(L18=15,M$41,IF(L18=16,M$41,IF(L18=17,M$41,IF(L18=18,M$41,IF(L18=19,M$41,IF(L18=20,M$41,IF(L18=\"\",0,\"0\")))))))))))))))))))))","v":0},null,{"$f":"IF(N18=1,O$31,IF(N18=2,O$32,IF(N18=3,O$33,IF(N18=4,O$34,IF(N18=5,O$35,IF(N18=6,O$36,IF(N18=7,O$37,IF(N18=8,O$38,IF(N18=9,O$39,IF(N18=10,O$40,IF(N18=11,O$41,IF(N18=12,O$41,IF(N18=13,O$41,IF(N18=14,O$41,IF(N18=15,O$41,IF(N18=16,O$41,IF(N18=17,O$41,IF(N18=18,O$41,IF(N18=19,O$41,IF(N18=20,O$41,IF(N18=\"\",0,\"0\")))))))))))))))))))))","v":0},0,"",0,0,0,0,0,0,0,0,0,0,0,0,0,0,0,0,0,0,0,0,0,0,0,0,0]
[null,10,{"$f":"IF(Grunddaten!D52=\"140\",\"\",Grunddaten!D52)","v":""},{"$f":"IF($C19=Pruefungsrangliste!$C$10,Pruefungsrangliste!$A$10,IF($C19=Pruefungsrangliste!$C$11,Pruefungsrangliste!$A$11,IF($C19=Pruefungsrangliste!$C$12,Pruefungsrangliste!$A$12,IF($C19=Pruefungsrangliste!$C$13,Pruefungsrangliste!$A$13,IF($C19=Pruefungsrangliste!$C$14,Pruefungsrangliste!$A$14,IF($C19=Pruefungsrangliste!$C$15,Pruefungsrangliste!$A$15,IF($C19=Pruefungsrangliste!$C$16,Pruefungsrangliste!$A$16,IF($C19=Pruefungsrangliste!$C$17,Pruefungsrangliste!$A$17,IF($C19=Pruefungsrangliste!$C$18,Pruefungsrangliste!$A$18,IF($C19=Pruefungsrangliste!$C$19,Pruefungsrangliste!$A$19,IF($C19=Pruefungsrangliste!$C$20,Pruefungsrangliste!$A$20,IF($C19=Pruefungsrangliste!$C$21,Pruefungsrangliste!$A$21,IF($C19=Pruefungsrangliste!$C$22,Pruefungsrangliste!$A$22,IF($C19=Pruefungsrangliste!$C$23,Pruefungsrangliste!$A$23,IF($C19=Pruefungsrangliste!$C$24,Pruefungsrangliste!$A$24,IF($C19=Pruefungsrangliste!$C$25,Pruefungsrangliste!$A$25,IF($C19=Pruefungsrangliste!$C$26,Pruefungsrangliste!$A$26,IF($C19=Pruefungsrangliste!$C$27,Pruefungsrangliste!$A$27,IF($C19=Pruefungsrangliste!$C$28,Pruefungsrangliste!$A$28,IF($C19=Pruefungsrangliste!$C$29,Pruefungsrangliste!$A$29,\"\"))))))))))))))))))))","v":""},0,null,0,null,0,null,{"$f":"IF(J19=1,K$31,IF(J19=2,K$32,IF(J19=3,K$33,IF(J19=4,K$34,IF(J19=5,K$35,IF(J19=6,K$36,IF(J19=7,K$37,IF(J19=8,K$38,IF(J19=9,K$39,IF(J19=10,K$40,IF(J19=11,K$41,IF(J19=12,K$41,IF(J19=13,K$41,IF(J19=14,K$41,IF(J19=15,K$41,IF(J19=16,K$41,IF(J19=17,K$41,IF(J19=18,K$41,IF(J19=19,K$41,IF(J19=20,K$41,IF(J19=\"\",0,\"0\")))))))))))))))))))))","v":0},null,{"$f":"IF(L19=1,M$31,IF(L19=2,M$32,IF(L19=3,M$33,IF(L19=4,M$34,IF(L19=5,M$35,IF(L19=6,M$36,IF(L19=7,M$37,IF(L19=8,M$38,IF(L19=9,M$39,IF(L19=10,M$40,IF(L19=11,M$41,IF(L19=12,M$41,IF(L19=13,M$41,IF(L19=14,M$41,IF(L19=15,M$41,IF(L19=16,M$41,IF(L19=17,M$41,IF(L19=18,M$41,IF(L19=19,M$41,IF(L19=20,M$41,IF(L19=\"\",0,\"0\")))))))))))))))))))))","v":0},null,{"$f":"IF(N19=1,O$31,IF(N19=2,O$32,IF(N19=3,O$33,IF(N19=4,O$34,IF(N19=5,O$35,IF(N19=6,O$36,IF(N19=7,O$37,IF(N19=8,O$38,IF(N19=9,O$39,IF(N19=10,O$40,IF(N19=11,O$41,IF(N19=12,O$41,IF(N19=13,O$41,IF(N19=14,O$41,IF(N19=15,O$41,IF(N19=16,O$41,IF(N19=17,O$41,IF(N19=18,O$41,IF(N19=19,O$41,IF(N19=20,O$41,IF(N19=\"\",0,\"0\")))))))))))))))))))))","v":0},0,"",0,0,0,0,0,0,0,0,0,0,0,0,0,0,0,0,0,0,0,0,0,0,0,0,0]
[null,11,{"$f":"IF(Grunddaten!D28=\"116\",\"\",Grunddaten!D28)","v":""},{"$f":"IF($C20=Pruefungsrangliste!$C$10,Pruefungsrangliste!$A$10,IF($C20=Pruefungsrangliste!$C$11,Pruefungsrangliste!$A$11,IF($C20=Pruefungsrangliste!$C$12,Pruefungsrangliste!$A$12,IF($C20=Pruefungsrangliste!$C$13,Pruefungsrangliste!$A$13,IF($C20=Pruefungsrangliste!$C$14,Pruefungsrangliste!$A$14,IF($C20=Pruefungsrangliste!$C$15,Pruefungsrangliste!$A$15,IF($C20=Pruefungsrangliste!$C$16,Pruefungsrangliste!$A$16,IF($C20=Pruefungsrangliste!$C$17,Pruefungsrangliste!$A$17,IF($C20=Pruefungsrangliste!$C$18,Pruefungsrangliste!$A$18,IF($C20=Pruefungsrangliste!$C$19,Pruefungsrangliste!$A$19,IF($C20=Pruefungsrangliste!$C$20,Pruefungsrangliste!$A$20,IF($C20=Pruefungsrangliste!$C$21,Pruefungsrangliste!$A$21,IF($C20=Pruefungsrangliste!$C$22,Pruefungsrangliste!$A$22,IF($C20=Pruefungsrangliste!$C$23,Pruefungsrangliste!$A$23,IF($C20=Pruefungsrangliste!$C$24,Pruefungsrangliste!$A$24,IF($C20=Pruefungsrangliste!$C$25,Pruefungsrangliste!$A$25,IF($C20=Pruefungsrangliste!$C$26,Pruefungsrangliste!$A$26,IF($C20=Pruefungsrangliste!$C$27,Pruefungsrangliste!$A$27,IF($C20=Pruefungsrangliste!$C$28,Pruefungsrangliste!$A$28,IF($C20=Pruefungsrangliste!$C$29,Pruefungsrangliste!$A$29,\"\"))))))))))))))))))))","v":""},0,null,0,null,0,null,{"$f":"IF(J20=1,K$31,IF(J20=2,K$32,IF(J20=3,K$33,IF(J20=4,K$34,IF(J20=5,K$35,IF(J20=6,K$36,IF(J20=7,K$37,IF(J20=8,K$38,IF(J20=9,K$39,IF(J20=10,K$40,IF(J20=11,K$41,IF(J20=12,K$41,IF(J20=13,K$41,IF(J20=14,K$41,IF(J20=15,K$41,IF(J20=16,K$41,IF(J20=17,K$41,IF(J20=18,K$41,IF(J20=19,K$41,IF(J20=20,K$41,IF(J20=\"\",0,\"0\")))))))))))))))))))))","v":0},null,{"$f":"IF(L20=1,M$31,IF(L20=2,M$32,IF(L20=3,M$33,IF(L20=4,M$34,IF(L20=5,M$35,IF(L20=6,M$36,IF(L20=7,M$37,IF(L20=8,M$38,IF(L20=9,M$39,IF(L20=10,M$40,IF(L20=11,M$41,IF(L20=12,M$41,IF(L20=13,M$41,IF(L20=14,M$41,IF(L20=15,M$41,IF(L20=16,M$41,IF(L20=17,M$41,IF(L20=18,M$41,IF(L20=19,M$41,IF(L20=20,M$41,IF(L20=\"\",0,\"0\")))))))))))))))))))))","v":0},null,{"$f":"IF(N20=1,O$31,IF(N20=2,O$32,IF(N20=3,O$33,IF(N20=4,O$34,IF(N20=5,O$35,IF(N20=6,O$36,IF(N20=7,O$37,IF(N20=8,O$38,IF(N20=9,O$39,IF(N20=10,O$40,IF(N20=11,O$41,IF(N20=12,O$41,IF(N20=13,O$41,IF(N20=14,O$41,IF(N20=15,O$41,IF(N20=16,O$41,IF(N20=17,O$41,IF(N20=18,O$41,IF(N20=19,O$41,IF(N20=20,O$41,IF(N20=\"\",0,\"0\")))))))))))))))))))))","v":0},0,"",0,0,0,0,0,0,0,0,0,0,0,0,0,0,0,0,0,0,0,0,0,0,0,0,0]
[null,12,{"$f":"IF(Grunddaten!D32=\"120\",\"\",Grunddaten!D32)","v":""},{"$f":"IF($C21=Pruefungsrangliste!$C$10,Pruefungsrangliste!$A$10,IF($C21=Pruefungsrangliste!$C$11,Pruefungsrangliste!$A$11,IF($C21=Pruefungsrangliste!$C$12,Pruefungsrangliste!$A$12,IF($C21=Pruefungsrangliste!$C$13,Pruefungsrangliste!$A$13,IF($C21=Pruefungsrangliste!$C$14,Pruefungsrangliste!$A$14,IF($C21=Pruefungsrangliste!$C$15,Pruefungsrangliste!$A$15,IF($C21=Pruefungsrangliste!$C$16,Pruefungsrangliste!$A$16,IF($C21=Pruefungsrangliste!$C$17,Pruefungsrangliste!$A$17,IF($C21=Pruefungsrangliste!$C$18,Pruefungsrangliste!$A$18,IF($C21=Pruefungsrangliste!$C$19,Pruefungsrangliste!$A$19,IF($C21=Pruefungsrangliste!$C$20,Pruefungsrangliste!$A$20,IF($C21=Pruefungsrangliste!$C$21,Pruefungsrangliste!$A$21,IF($C21=Pruefungsrangliste!$C$22,Pruefungsrangliste!$A$22,IF($C21=Pruefungsrangliste!$C$23,Pruefungsrangliste!$A$23,IF($C21=Pruefungsrangliste!$C$24,Pruefungsrangliste!$A$24,IF($C21=Pruefungsrangliste!$C$25,Pruefungsrangliste!$A$25,IF($C21=Pruefungsrangliste!$C$26,Pruefungsrangliste!$A$26,IF($C21=Pruefungsrangliste!$C$27,Pruefungsrangliste!$A$27,IF($C21=Pruefungsrangliste!$C$28,Pruefungsrangliste!$A$28,IF($C21=Pruefungsrangliste!$C$29,Pruefungsrangliste!$A$29,\"\"))))))))))))))))))))","v":""},0,null,0,null,0,null,{"$f":"IF(J21=1,K$31,IF(J21=2,K$32,IF(J21=3,K$33,IF(J21=4,K$34,IF(J21=5,K$35,IF(J21=6,K$36,IF(J21=7,K$37,IF(J21=8,K$38,IF(J21=9,K$39,IF(J21=10,K$40,IF(J21=11,K$41,IF(J21=12,K$41,IF(J21=13,K$41,IF(J21=14,K$41,IF(J21=15,K$41,IF(J21=16,K$41,IF(J21=17,K$41,IF(J21=18,K$41,IF(J21=19,K$41,IF(J21=20,K$41,IF(J21=\"\",0,\"0\")))))))))))))))))))))","v":0},null,{"$f":"IF(L21=1,M$31,IF(L21=2,M$32,IF(L21=3,M$33,IF(L21=4,M$34,IF(L21=5,M$35,IF(L21=6,M$36,IF(L21=7,M$37,IF(L21=8,M$38,IF(L21=9,M$39,IF(L21=10,M$40,IF(L21=11,M$41,IF(L21=12,M$41,IF(L21=13,M$41,IF(L21=14,M$41,IF(L21=15,M$41,IF(L21=16,M$41,IF(L21=17,M$41,IF(L21=18,M$41,IF(L21=19,M$41,IF(L21=20,M$41,IF(L21=\"\",0,\"0\")))))))))))))))))))))","v":0},null,{"$f":"IF(N21=1,O$31,IF(N21=2,O$32,IF(N21=3,O$33,IF(N21=4,O$34,IF(N21=5,O$35,IF(N21=6,O$36,IF(N21=7,O$37,IF(N21=8,O$38,IF(N21=9,O$39,IF(N21=10,O$40,IF(N21=11,O$41,IF(N21=12,O$41,IF(N21=13,O$41,IF(N21=14,O$41,IF(N21=15,O$41,IF(N21=16,O$41,IF(N21=17,O$41,IF(N21=18,O$41,IF(N21=19,O$41,IF(N21=20,O$41,IF(N21=\"\",0,\"0\")))))))))))))))))))))","v":0},0,"",0,0,0,0,0,0,0,0,0,0,0,0,0,0,0,0,0,0,0,0,0,0,0,0,0]
[null,13,{"$f":"IF(Grunddaten!D36=\"124\",\"\",Grunddaten!D36)","v":""},{"$f":"IF($C22=Pruefungsrangliste!$C$10,Pruefungsrangliste!$A$10,IF($C22=Pruefungsrangliste!$C$11,Pruefungsrangliste!$A$11,IF($C22=Pruefungsrangliste!$C$12,Pruefungsrangliste!$A$12,IF($C22=Pruefungsrangliste!$C$13,Pruefungsrangliste!$A$13,IF($C22=Pruefungsrangliste!$C$14,Pruefungsrangliste!$A$14,IF($C22=Pruefungsrangliste!$C$15,Pruefungsrangliste!$A$15,IF($C22=Pruefungsrangliste!$C$16,Pruefungsrangliste!$A$16,IF($C22=Pruefungsrangliste!$C$17,Pruefungsrangliste!$A$17,IF($C22=Pruefungsrangliste!$C$18,Pruefungsrangliste!$A$18,IF($C22=Pruefungsrangliste!$C$19,Pruefungsrangliste!$A$19,IF($C22=Pruefungsrangliste!$C$20,Pruefungsrangliste!$A$20,IF($C22=Pruefungsrangliste!$C$21,Pruefungsrangliste!$A$21,IF($C22=Pruefungsrangliste!$C$22,Pruefungsrangliste!$A$22,IF($C22=Pruefungsrangliste!$C$23,Pruefungsrangliste!$A$23,IF($C22=Pruefungsrangliste!$C$24,Pruefungsrangliste!$A$24,IF($C22=Pruefungsrangliste!$C$25,Pruefungsrangliste!$A$25,IF($C22=Pruefungsrangliste!$C$26,Pruefungsrangliste!$A$26,IF($C22=Pruefungsrangliste!$C$27,Pruefungsrangliste!$A$27,IF($C22=Pruefungsrangliste!$C$28,Pruefungsrangliste!$A$28,IF($C22=Pruefungsrangliste!$C$29,Pruefungsrangliste!$A$29,\"\"))))))))))))))))))))","v":""},0,null,0,null,0,null,{"$f":"IF(J22=1,K$31,IF(J22=2,K$32,IF(J22=3,K$33,IF(J22=4,K$34,IF(J22=5,K$35,IF(J22=6,K$36,IF(J22=7,K$37,IF(J22=8,K$38,IF(J22=9,K$39,IF(J22=10,K$40,IF(J22=11,K$41,IF(J22=12,K$41,IF(J22=13,K$41,IF(J22=14,K$41,IF(J22=15,K$41,IF(J22=16,K$41,IF(J22=17,K$41,IF(J22=18,K$41,IF(J22=19,K$41,IF(J22=20,K$41,IF(J22=\"\",0,\"0\")))))))))))))))))))))","v":0},null,{"$f":"IF(L22=1,M$31,IF(L22=2,M$32,IF(L22=3,M$33,IF(L22=4,M$34,IF(L22=5,M$35,IF(L22=6,M$36,IF(L22=7,M$37,IF(L22=8,M$38,IF(L22=9,M$39,IF(L22=10,M$40,IF(L22=11,M$41,IF(L22=12,M$41,IF(L22=13,M$41,IF(L22=14,M$41,IF(L22=15,M$41,IF(L22=16,M$41,IF(L22=17,M$41,IF(L22=18,M$41,IF(L22=19,M$41,IF(L22=20,M$41,IF(L22=\"\",0,\"0\")))))))))))))))))))))","v":0},null,{"$f":"IF(N22=1,O$31,IF(N22=2,O$32,IF(N22=3,O$33,IF(N22=4,O$34,IF(N22=5,O$35,IF(N22=6,O$36,IF(N22=7,O$37,IF(N22=8,O$38,IF(N22=9,O$39,IF(N22=10,O$40,IF(N22=11,O$41,IF(N22=12,O$41,IF(N22=13,O$41,IF(N22=14,O$41,IF(N22=15,O$41,IF(N22=16,O$41,IF(N22=17,O$41,IF(N22=18,O$41,IF(N22=19,O$41,IF(N22=20,O$41,IF(N22=\"\",0,\"0\")))))))))))))))))))))","v":0},0,"",0,0,0,0,0,0,0,0,0,0,0,0,0,0,0,0,0,0,0,0,0,0,0,0,0]
[null,14,{"$f":"IF(Grunddaten!D24=\"112\",\"\",Grunddaten!D24)","v":""},{"$f":"IF($C23=Pruefungsrangliste!$C$10,Pruefungsrangliste!$A$10,IF($C23=Pruefungsrangliste!$C$11,Pruefungsrangliste!$A$11,IF($C23=Pruefungsrangliste!$C$12,Pruefungsrangliste!$A$12,IF($C23=Pruefungsrangliste!$C$13,Pruefungsrangliste!$A$13,IF($C23=Pruefungsrangliste!$C$14,Pruefungsrangliste!$A$14,IF($C23=Pruefungsrangliste!$C$15,Pruefungsrangliste!$A$15,IF($C23=Pruefungsrangliste!$C$16,Pruefungsrangliste!$A$16,IF($C23=Pruefungsrangliste!$C$17,Pruefungsrangliste!$A$17,IF($C23=Pruefungsrangliste!$C$18,Pruefungsrangliste!$A$18,IF($C23=Pruefungsrangliste!$C$19,Pruefungsrangliste!$A$19,IF($C23=Pruefungsrangliste!$C$20,Pruefungsrangliste!$A$20,IF($C23=Pruefungsrangliste!$C$21,Pruefungsrangliste!$A$21,IF($C23=Pruefungsrangliste!$C$22,Pruefungsrangliste!$A$22,IF($C23=Pruefungsrangliste!$C$23,Pruefungsrangliste!$A$23,IF($C23=Pruefungsrangliste!$C$24,Pruefungsrangliste!$A$24,IF($C23=Pruefungsrangliste!$C$25,Pruefungsrangliste!$A$25,IF($C23=Pruefungsrangliste!$C$26,Pruefungsrangliste!$A$26,IF($C23=Pruefungsrangliste!$C$27,Pruefungsrangliste!$A$27,IF($C23=Pruefungsrangliste!$C$28,Pruefungsrangliste!$A$28,IF($C23=Pruefungsrangliste!$C$29,Pruefungsrangliste!$A$29,\"\"))))))))))))))))))))","v":""},0,null,0,null,0,null,{"$f":"IF(J23=1,K$31,IF(J23=2,K$32,IF(J23=3,K$33,IF(J23=4,K$34,IF(J23=5,K$35,IF(J23=6,K$36,IF(J23=7,K$37,IF(J23=8,K$38,IF(J23=9,K$39,IF(J23=10,K$40,IF(J23=11,K$41,IF(J23=12,K$41,IF(J23=13,K$41,IF(J23=14,K$41,IF(J23=15,K$41,IF(J23=16,K$41,IF(J23=17,K$41,IF(J23=18,K$41,IF(J23=19,K$41,IF(J23=20,K$41,IF(J23=\"\",0,\"0\")))))))))))))))))))))","v":0},null,{"$f":"IF(L23=1,M$31,IF(L23=2,M$32,IF(L23=3,M$33,IF(L23=4,M$34,IF(L23=5,M$35,IF(L23=6,M$36,IF(L23=7,M$37,IF(L23=8,M$38,IF(L23=9,M$39,IF(L23=10,M$40,IF(L23=11,M$41,IF(L23=12,M$41,IF(L23=13,M$41,IF(L23=14,M$41,IF(L23=15,M$41,IF(L23=16,M$41,IF(L23=17,M$41,IF(L23=18,M$41,IF(L23=19,M$41,IF(L23=20,M$41,IF(L23=\"\",0,\"0\")))))))))))))))))))))","v":0},null,{"$f":"IF(N23=1,O$31,IF(N23=2,O$32,IF(N23=3,O$33,IF(N23=4,O$34,IF(N23=5,O$35,IF(N23=6,O$36,IF(N23=7,O$37,IF(N23=8,O$38,IF(N23=9,O$39,IF(N23=10,O$40,IF(N23=11,O$41,IF(N23=12,O$41,IF(N23=13,O$41,IF(N23=14,O$41,IF(N23=15,O$41,IF(N23=16,O$41,IF(N23=17,O$41,IF(N23=18,O$41,IF(N23=19,O$41,IF(N23=20,O$41,IF(N23=\"\",0,\"0\")))))))))))))))))))))","v":0},0,"",0,0,0,0,0,0,0,0,0,0,0,0,0,0,0,0,0,0,0,0,0,0,0,0,0]
[null,15,{"$f":"IF(Grunddaten!D68=\"156\",\"\",Grunddaten!D68)","v":""},{"$f":"IF($C24=Pruefungsrangliste!$C$10,Pruefungsrangliste!$A$10,IF($C24=Pruefungsrangliste!$C$11,Pruefungsrangliste!$A$11,IF($C24=Pruefungsrangliste!$C$12,Pruefungsrangliste!$A$12,IF($C24=Pruefungsrangliste!$C$13,Pruefungsrangliste!$A$13,IF($C24=Pruefungsrangliste!$C$14,Pruefungsrangliste!$A$14,IF($C24=Pruefungsrangliste!$C$15,Pruefungsrangliste!$A$15,IF($C24=Pruefungsrangliste!$C$16,Pruefungsrangliste!$A$16,IF($C24=Pruefungsrangliste!$C$17,Pruefungsrangliste!$A$17,IF($C24=Pruefungsrangliste!$C$18,Pruefungsrangliste!$A$18,IF($C24=Pruefungsrangliste!$C$19,Pruefungsrangliste!$A$19,IF($C24=Pruefungsrangliste!$C$20,Pruefungsrangliste!$A$20,IF($C24=Pruefungsrangliste!$C$21,Pruefungsrangliste!$A$21,IF($C24=Pruefungsrangliste!$C$22,Pruefungsrangliste!$A$22,IF($C24=Pruefungsrangliste!$C$23,Pruefungsrangliste!$A$23,IF($C24=Pruefungsrangliste!$C$24,Pruefungsrangliste!$A$24,IF($C24=Pruefungsrangliste!$C$25,Pruefungsrangliste!$A$25,IF($C24=Pruefungsrangliste!$C$26,Pruefungsrangliste!$A$26,IF($C24=Pruefungsrangliste!$C$27,Pruefungsrangliste!$A$27,IF($C24=Pruefungsrangliste!$C$28,Pruefungsrangliste!$A$28,IF($C24=Pruefungsrangliste!$C$29,Pruefungsrangliste!$A$29,\"\"))))))))))))))))))))","v":""},0,null,0,null,0,null,{"$f":"IF(J24=1,K$31,IF(J24=2,K$32,IF(J24=3,K$33,IF(J24=4,K$34,IF(J24=5,K$35,IF(J24=6,K$36,IF(J24=7,K$37,IF(J24=8,K$38,IF(J24=9,K$39,IF(J24=10,K$40,IF(J24=11,K$41,IF(J24=12,K$41,IF(J24=13,K$41,IF(J24=14,K$41,IF(J24=15,K$41,IF(J24=16,K$41,IF(J24=17,K$41,IF(J24=18,K$41,IF(J24=19,K$41,IF(J24=20,K$41,IF(J24=\"\",0,\"0\")))))))))))))))))))))","v":0},null,{"$f":"IF(L24=1,M$31,IF(L24=2,M$32,IF(L24=3,M$33,IF(L24=4,M$34,IF(L24=5,M$35,IF(L24=6,M$36,IF(L24=7,M$37,IF(L24=8,M$38,IF(L24=9,M$39,IF(L24=10,M$40,IF(L24=11,M$41,IF(L24=12,M$41,IF(L24=13,M$41,IF(L24=14,M$41,IF(L24=15,M$41,IF(L24=16,M$41,IF(L24=17,M$41,IF(L24=18,M$41,IF(L24=19,M$41,IF(L24=20,M$41,IF(L24=\"\",0,\"0\")))))))))))))))))))))","v":0},null,{"$f":"IF(N24=1,O$31,IF(N24=2,O$32,IF(N24=3,O$33,IF(N24=4,O$34,IF(N24=5,O$35,IF(N24=6,O$36,IF(N24=7,O$37,IF(N24=8,O$38,IF(N24=9,O$39,IF(N24=10,O$40,IF(N24=11,O$41,IF(N24=12,O$41,IF(N24=13,O$41,IF(N24=14,O$41,IF(N24=15,O$41,IF(N24=16,O$41,IF(N24=17,O$41,IF(N24=18,O$41,IF(N24=19,O$41,IF(N24=20,O$41,IF(N24=\"\",0,\"0\")))))))))))))))))))))","v":0},0,"",0,0,0,0,0,0,0,0,0,0,0,0,0,0,0,0,0,0,0,0,0,0,0,0,0]
[null,16,{"$f":"IF(Grunddaten!D72=\"160\",\"\",Grunddaten!D72)","v":""},{"$f":"IF($C25=Pruefungsrangliste!$C$10,Pruefungsrangliste!$A$10,IF($C25=Pruefungsrangliste!$C$11,Pruefungsrangliste!$A$11,IF($C25=Pruefungsrangliste!$C$12,Pruefungsrangliste!$A$12,IF($C25=Pruefungsrangliste!$C$13,Pruefungsrangliste!$A$13,IF($C25=Pruefungsrangliste!$C$14,Pruefungsrangliste!$A$14,IF($C25=Pruefungsrangliste!$C$15,Pruefungsrangliste!$A$15,IF($C25=Pruefungsrangliste!$C$16,Pruefungsrangliste!$A$16,IF($C25=Pruefungsrangliste!$C$17,Pruefungsrangliste!$A$17,IF($C25=Pruefungsrangliste!$C$18,Pruefungsrangliste!$A$18,IF($C25=Pruefungsrangliste!$C$19,Pruefungsrangliste!$A$19,IF($C25=Pruefungsrangliste!$C$20,Pruefungsrangliste!$A$20,IF($C25=Pruefungsrangliste!$C$21,Pruefungsrangliste!$A$21,IF($C25=Pruefungsrangliste!$C$22,Pruefungsrangliste!$A$22,IF($C25=Pruefungsrangliste!$C$23,Pruefungsrangliste!$A$23,IF($C25=Pruefungsrangliste!$C$24,Pruefungsrangliste!$A$24,IF($C25=Pruefungsrangliste!$C$25,Pruefungsrangliste!$A$25,IF($C25=Pruefungsrangliste!$C$26,Pruefungsrangliste!$A$26,IF($C25=Pruefungsrangliste!$C$27,Pruefungsrangliste!$A$27,IF($C25=Pruefungsrangliste!$C$28,Pruefungsrangliste!$A$28,IF($C25=Pruefungsrangliste!$C$29,Pruefungsrangliste!$A$29,\"\"))))))))))))))))))))","v":""},0,null,0,null,0,null,{"$f":"IF(J25=1,K$31,IF(J25=2,K$32,IF(J25=3,K$33,IF(J25=4,K$34,IF(J25=5,K$35,IF(J25=6,K$36,IF(J25=7,K$37,IF(J25=8,K$38,IF(J25=9,K$39,IF(J25=10,K$40,IF(J25=11,K$41,IF(J25=12,K$41,IF(J25=13,K$41,IF(J25=14,K$41,IF(J25=15,K$41,IF(J25=16,K$41,IF(J25=17,K$41,IF(J25=18,K$41,IF(J25=19,K$41,IF(J25=20,K$41,IF(J25=\"\",0,\"0\")))))))))))))))))))))","v":0},null,{"$f":"IF(L25=1,M$31,IF(L25=2,M$32,IF(L25=3,M$33,IF(L25=4,M$34,IF(L25=5,M$35,IF(L25=6,M$36,IF(L25=7,M$37,IF(L25=8,M$38,IF(L25=9,M$39,IF(L25=10,M$40,IF(L25=11,M$41,IF(L25=12,M$41,IF(L25=13,M$41,IF(L25=14,M$41,IF(L25=15,M$41,IF(L25=16,M$41,IF(L25=17,M$41,IF(L25=18,M$41,IF(L25=19,M$41,IF(L25=20,M$41,IF(L25=\"\",0,\"0\")))))))))))))))))))))","v":0},null,{"$f":"IF(N25=1,O$31,IF(N25=2,O$32,IF(N25=3,O$33,IF(N25=4,O$34,IF(N25=5,O$35,IF(N25=6,O$36,IF(N25=7,O$37,IF(N25=8,O$38,IF(N25=9,O$39,IF(N25=10,O$40,IF(N25=11,O$41,IF(N25=12,O$41,IF(N25=13,O$41,IF(N25=14,O$41,IF(N25=15,O$41,IF(N25=16,O$41,IF(N25=17,O$41,IF(N25=18,O$41,IF(N25=19,O$41,IF(N25=20,O$41,IF(N25=\"\",0,\"0\")))))))))))))))))))))","v":0},0,"",0,0,0,0,0,0,0,0,0,0,0,0,0,0,0,0,0,0,0,0,0,0,0,0,0]
[null,17,{"$f":"IF(Grunddaten!D76=\"164\",\"\",Grunddaten!D76)","v":""},{"$f":"IF($C26=Pruefungsrangliste!$C$10,Pruefungsrangliste!$A$10,IF($C26=Pruefungsrangliste!$C$11,Pruefungsrangliste!$A$11,IF($C26=Pruefungsrangliste!$C$12,Pruefungsrangliste!$A$12,IF($C26=Pruefungsrangliste!$C$13,Pruefungsrangliste!$A$13,IF($C26=Pruefungsrangliste!$C$14,Pruefungsrangliste!$A$14,IF($C26=Pruefungsrangliste!$C$15,Pruefungsrangliste!$A$15,IF($C26=Pruefungsrangliste!$C$16,Pruefungsrangliste!$A$16,IF($C26=Pruefungsrangliste!$C$17,Pruefungsrangliste!$A$17,IF($C26=Pruefungsrangliste!$C$18,Pruefungsrangliste!$A$18,IF($C26=Pruefungsrangliste!$C$19,Pruefungsrangliste!$A$19,IF($C26=Pruefungsrangliste!$C$20,Pruefungsrangliste!$A$20,IF($C26=Pruefungsrangliste!$C$21,Pruefungsrangliste!$A$21,IF($C26=Pruefungsrangliste!$C$22,Pruefungsrangliste!$A$22,IF($C26=Pruefungsrangliste!$C$23,Pruefungsrangliste!$A$23,IF($C26=Pruefungsrangliste!$C$24,Pruefungsrangliste!$A$24,IF($C26=Pruefungsrangliste!$C$25,Pruefungsrangliste!$A$25,IF($C26=Pruefungsrangliste!$C$26,Pruefungsrangliste!$A$26,IF($C26=Pruefungsrangliste!$C$27,Pruefungsrangliste!$A$27,IF($C26=Pruefungsrangliste!$C$28,Pruefungsrangliste!$A$28,IF($C26=Pruefungsrangliste!$C$29,Pruefungsrangliste!$A$29,\"\"))))))))))))))))))))","v":""},0,null,0,null,0,null,{"$f":"IF(J26=1,K$31,IF(J26=2,K$32,IF(J26=3,K$33,IF(J26=4,K$34,IF(J26=5,K$35,IF(J26=6,K$36,IF(J26=7,K$37,IF(J26=8,K$38,IF(J26=9,K$39,IF(J26=10,K$40,IF(J26=11,K$41,IF(J26=12,K$41,IF(J26=13,K$41,IF(J26=14,K$41,IF(J26=15,K$41,IF(J26=16,K$41,IF(J26=17,K$41,IF(J26=18,K$41,IF(J26=19,K$41,IF(J26=20,K$41,IF(J26=\"\",0,\"0\")))))))))))))))))))))","v":0},null,{"$f":"IF(L26=1,M$31,IF(L26=2,M$32,IF(L26=3,M$33,IF(L26=4,M$34,IF(L26=5,M$35,IF(L26=6,M$36,IF(L26=7,M$37,IF(L26=8,M$38,IF(L26=9,M$39,IF(L26=10,M$40,IF(L26=11,M$41,IF(L26=12,M$41,IF(L26=13,M$41,IF(L26=14,M$41,IF(L26=15,M$41,IF(L26=16,M$41,IF(L26=17,M$41,IF(L26=18,M$41,IF(L26=19,M$41,IF(L26=20,M$41,IF(L26=\"\",0,\"0\")))))))))))))))))))))","v":0},null,{"$f":"IF(N26=1,O$31,IF(N26=2,O$32,IF(N26=3,O$33,IF(N26=4,O$34,IF(N26=5,O$35,IF(N26=6,O$36,IF(N26=7,O$37,IF(N26=8,O$38,IF(N26=9,O$39,IF(N26=10,O$40,IF(N26=11,O$41,IF(N26=12,O$41,IF(N26=13,O$41,IF(N26=14,O$41,IF(N26=15,O$41,IF(N26=16,O$41,IF(N26=17,O$41,IF(N26=18,O$41,IF(N26=19,O$41,IF(N26=20,O$41,IF(N26=\"\",0,\"0\")))))))))))))))))))))","v":0},0,"",0,0,0,0,0,0,0,0,0,0,0,0,0,0,0,0,0,0,0,0,0,0,0,0,0]
[null,18,{"$f":"IF(Grunddaten!D80=\"168\",\"\",Grunddaten!D80)","v":""},{"$f":"IF($C27=Pruefungsrangliste!$C$10,Pruefungsrangliste!$A$10,IF($C27=Pruefungsrangliste!$C$11,Pruefungsrangliste!$A$11,IF($C27=Pruefungsrangliste!$C$12,Pruefungsrangliste!$A$12,IF($C27=Pruefungsrangliste!$C$13,Pruefungsrangliste!$A$13,IF($C27=Pruefungsrangliste!$C$14,Pruefungsrangliste!$A$14,IF($C27=Pruefungsrangliste!$C$15,Pruefungsrangliste!$A$15,IF($C27=Pruefungsrangliste!$C$16,Pruefungsrangliste!$A$16,IF($C27=Pruefungsrangliste!$C$17,Pruefungsrangliste!$A$17,IF($C27=Pruefungsrangliste!$C$18,Pruefungsrangliste!$A$18,IF($C27=Pruefungsrangliste!$C$19,Pruefungsrangliste!$A$19,IF($C27=Pruefungsrangliste!$C$20,Pruefungsrangliste!$A$20,IF($C27=Pruefungsrangliste!$C$21,Pruefungsrangliste!$A$21,IF($C27=Pruefungsrangliste!$C$22,Pruefungsrangliste!$A$22,IF($C27=Pruefungsrangliste!$C$23,Pruefungsrangliste!$A$23,IF($C27=Pruefungsrangliste!$C$24,Pruefungsrangliste!$A$24,IF($C27=Pruefungsrangliste!$C$25,Pruefungsrangliste!$A$25,IF($C27=Pruefungsrangliste!$C$26,Pruefungsrangliste!$A$26,IF($C27=Pruefungsrangliste!$C$27,Pruefungsrangliste!$A$27,IF($C27=Pruefungsrangliste!$C$28,Pruefungsrangliste!$A$28,IF($C27=Pruefungsrangliste!$C$29,Pruefungsrangliste!$A$29,\"\"))))))))))))))))))))","v":""},0,null,0,null,0,null,{"$f":"IF(J27=1,K$31,IF(J27=2,K$32,IF(J27=3,K$33,IF(J27=4,K$34,IF(J27=5,K$35,IF(J27=6,K$36,IF(J27=7,K$37,IF(J27=8,K$38,IF(J27=9,K$39,IF(J27=10,K$40,IF(J27=11,K$41,IF(J27=12,K$41,IF(J27=13,K$41,IF(J27=14,K$41,IF(J27=15,K$41,IF(J27=16,K$41,IF(J27=17,K$41,IF(J27=18,K$41,IF(J27=19,K$41,IF(J27=20,K$41,IF(J27=\"\",0,\"0\")))))))))))))))))))))","v":0},null,{"$f":"IF(L27=1,M$31,IF(L27=2,M$32,IF(L27=3,M$33,IF(L27=4,M$34,IF(L27=5,M$35,IF(L27=6,M$36,IF(L27=7,M$37,IF(L27=8,M$38,IF(L27=9,M$39,IF(L27=10,M$40,IF(L27=11,M$41,IF(L27=12,M$41,IF(L27=13,M$41,IF(L27=14,M$41,IF(L27=15,M$41,IF(L27=16,M$41,IF(L27=17,M$41,IF(L27=18,M$41,IF(L27=19,M$41,IF(L27=20,M$41,IF(L27=\"\",0,\"0\")))))))))))))))))))))","v":0},null,{"$f":"IF(N27=1,O$31,IF(N27=2,O$32,IF(N27=3,O$33,IF(N27=4,O$34,IF(N27=5,O$35,IF(N27=6,O$36,IF(N27=7,O$37,IF(N27=8,O$38,IF(N27=9,O$39,IF(N27=10,O$40,IF(N27=11,O$41,IF(N27=12,O$41,IF(N27=13,O$41,IF(N27=14,O$41,IF(N27=15,O$41,IF(N27=16,O$41,IF(N27=17,O$41,IF(N27=18,O$41,IF(N27=19,O$41,IF(N27=20,O$41,IF(N27=\"\",0,\"0\")))))))))))))))))))))","v":0},0,"",0,0,0,0,0,0,0,0,0,0,0,0,0,0,0,0,0,0,0,0,0,0,0,0,0]
[null,19,{"$f":"IF(Grunddaten!D84=\"172\",\"\",Grunddaten!D84)","v":""},{"$f":"IF($C28=Pruefungsrangliste!$C$10,Pruefungsrangliste!$A$10,IF($C28=Pruefungsrangliste!$C$11,Pruefungsrangliste!$A$11,IF($C28=Pruefungsrangliste!$C$12,Pruefungsrangliste!$A$12,IF($C28=Pruefungsrangliste!$C$13,Pruefungsrangliste!$A$13,IF($C28=Pruefungsrangliste!$C$14,Pruefungsrangliste!$A$14,IF($C28=Pruefungsrangliste!$C$15,Pruefungsrangliste!$A$15,IF($C28=Pruefungsrangliste!$C$16,Pruefungsrangliste!$A$16,IF($C28=Pruefungsrangliste!$C$17,Pruefungsrangliste!$A$17,IF($C28=Pruefungsrangliste!$C$18,Pruefungsrangliste!$A$18,IF($C28=Pruefungsrangliste!$C$19,Pruefungsrangliste!$A$19,IF($C28=Pruefungsrangliste!$C$20,Pruefungsrangliste!$A$20,IF($C28=Pruefungsrangliste!$C$21,Pruefungsrangliste!$A$21,IF($C28=Pruefungsrangliste!$C$22,Pruefungsrangliste!$A$22,IF($C28=Pruefungsrangliste!$C$23,Pruefungsrangliste!$A$23,IF($C28=Pruefungsrangliste!$C$24,Pruefungsrangliste!$A$24,IF($C28=Pruefungsrangliste!$C$25,Pruefungsrangliste!$A$25,IF($C28=Pruefungsrangliste!$C$26,Pruefungsrangliste!$A$26,IF($C28=Pruefungsrangliste!$C$27,Pruefungsrangliste!$A$27,IF($C28=Pruefungsrangliste!$C$28,Pruefungsrangliste!$A$28,IF($C28=Pruefungsrangliste!$C$29,Pruefungsrangliste!$A$29,\"\"))))))))))))))))))))","v":""},0,null,0,null,0,null,{"$f":"IF(J28=1,K$31,IF(J28=2,K$32,IF(J28=3,K$33,IF(J28=4,K$34,IF(J28=5,K$35,IF(J28=6,K$36,IF(J28=7,K$37,IF(J28=8,K$38,IF(J28=9,K$39,IF(J28=10,K$40,IF(J28=11,K$41,IF(J28=12,K$41,IF(J28=13,K$41,IF(J28=14,K$41,IF(J28=15,K$41,IF(J28=16,K$41,IF(J28=17,K$41,IF(J28=18,K$41,IF(J28=19,K$41,IF(J28=20,K$41,IF(J28=\"\",0,\"0\")))))))))))))))))))))","v":0},null,{"$f":"IF(L28=1,M$31,IF(L28=2,M$32,IF(L28=3,M$33,IF(L28=4,M$34,IF(L28=5,M$35,IF(L28=6,M$36,IF(L28=7,M$37,IF(L28=8,M$38,IF(L28=9,M$39,IF(L28=10,M$40,IF(L28=11,M$41,IF(L28=12,M$41,IF(L28=13,M$41,IF(L28=14,M$41,IF(L28=15,M$41,IF(L28=16,M$41,IF(L28=17,M$41,IF(L28=18,M$41,IF(L28=19,M$41,IF(L28=20,M$41,IF(L28=\"\",0,\"0\")))))))))))))))))))))","v":0},null,{"$f":"IF(N28=1,O$31,IF(N28=2,O$32,IF(N28=3,O$33,IF(N28=4,O$34,IF(N28=5,O$35,IF(N28=6,O$36,IF(N28=7,O$37,IF(N28=8,O$38,IF(N28=9,O$39,IF(N28=10,O$40,IF(N28=11,O$41,IF(N28=12,O$41,IF(N28=13,O$41,IF(N28=14,O$41,IF(N28=15,O$41,IF(N28=16,O$41,IF(N28=17,O$41,IF(N28=18,O$41,IF(N28=19,O$41,IF(N28=20,O$41,IF(N28=\"\",0,\"0\")))))))))))))))))))))","v":0},0,"",0,0,0,0,0,0,0,0,0,0,0,0,0,0,0,0,0,0,0,0,0,0,0,0,0]
[null,20,{"$f":"IF(Grunddaten!D88=\"176\",\"\",Grunddaten!D88)","v":""},{"$f":"IF($C29=Pruefungsrangliste!$C$10,Pruefungsrangliste!$A$10,IF($C29=Pruefungsrangliste!$C$11,Pruefungsrangliste!$A$11,IF($C29=Pruefungsrangliste!$C$12,Pruefungsrangliste!$A$12,IF($C29=Pruefungsrangliste!$C$13,Pruefungsrangliste!$A$13,IF($C29=Pruefungsrangliste!$C$14,Pruefungsrangliste!$A$14,IF($C29=Pruefungsrangliste!$C$15,Pruefungsrangliste!$A$15,IF($C29=Pruefungsrangliste!$C$16,Pruefungsrangliste!$A$16,IF($C29=Pruefungsrangliste!$C$17,Pruefungsrangliste!$A$17,IF($C29=Pruefungsrangliste!$C$18,Pruefungsrangliste!$A$18,IF($C29=Pruefungsrangliste!$C$19,Pruefungsrangliste!$A$19,IF($C29=Pruefungsrangliste!$C$20,Pruefungsrangliste!$A$20,IF($C29=Pruefungsrangliste!$C$21,Pruefungsrangliste!$A$21,IF($C29=Pruefungsrangliste!$C$22,Pruefungsrangliste!$A$22,IF($C29=Pruefungsrangliste!$C$23,Pruefungsrangliste!$A$23,IF($C29=Pruefungsrangliste!$C$24,Pruefungsrangliste!$A$24,IF($C29=Pruefungsrangliste!$C$25,Pruefungsrangliste!$A$25,IF($C29=Pruefungsrangliste!$C$26,Pruefungsrangliste!$A$26,IF($C29=Pruefungsrangliste!$C$27,Pruefungsrangliste!$A$27,IF($C29=Pruefungsrangliste!$C$28,Pruefungsrangliste!$A$28,IF($C29=Pruefungsrangliste!$C$29,Pruefungsrangliste!$A$29,\"\"))))))))))))))))))))","v":""},0,null,0,null,0,null,{"$f":"IF(J29=1,K$31,IF(J29=2,K$32,IF(J29=3,K$33,IF(J29=4,K$34,IF(J29=5,K$35,IF(J29=6,K$36,IF(J29=7,K$37,IF(J29=8,K$38,IF(J29=9,K$39,IF(J29=10,K$40,IF(J29=11,K$41,IF(J29=12,K$41,IF(J29=13,K$41,IF(J29=14,K$41,IF(J29=15,K$41,IF(J29=16,K$41,IF(J29=17,K$41,IF(J29=18,K$41,IF(J29=19,K$41,IF(J29=20,K$41,IF(J29=\"\",0,\"0\")))))))))))))))))))))","v":0},null,{"$f":"IF(L29=1,M$31,IF(L29=2,M$32,IF(L29=3,M$33,IF(L29=4,M$34,IF(L29=5,M$35,IF(L29=6,M$36,IF(L29=7,M$37,IF(L29=8,M$38,IF(L29=9,M$39,IF(L29=10,M$40,IF(L29=11,M$41,IF(L29=12,M$41,IF(L29=13,M$41,IF(L29=14,M$41,IF(L29=15,M$41,IF(L29=16,M$41,IF(L29=17,M$41,IF(L29=18,M$41,IF(L29=19,M$41,IF(L29=20,M$41,IF(L29=\"\",0,\"0\")))))))))))))))))))))","v":0},null,{"$f":"IF(N29=1,O$31,IF(N29=2,O$32,IF(N29=3,O$33,IF(N29=4,O$34,IF(N29=5,O$35,IF(N29=6,O$36,IF(N29=7,O$37,IF(N29=8,O$38,IF(N29=9,O$39,IF(N29=10,O$40,IF(N29=11,O$41,IF(N29=12,O$41,IF(N29=13,O$41,IF(N29=14,O$41,IF(N29=15,O$41,IF(N29=16,O$41,IF(N29=17,O$41,IF(N29=18,O$41,IF(N29=19,O$41,IF(N29=20,O$41,IF(N29=\"\",0,\"0\")))))))))))))))))))))","v":0},0,"",0,0,0,0,0,0,0,0,0,0,0,0,0,0,0,0,0,0,0,0,0,0,0,0,0]
[]
[null,null,null,"Punktetabelle:",12,null,12,null,12,null,12,null,12,null,12]
[null,null,null,null,10,null,10,null,10,null,10,null,10,null,10]
[null,null,null,null,9,null,9,null,9,null,9,null,9,null,9]
[null,null,null,null,8,null,8,null,8,null,8,null,8,null,8]
[null,null,null,null,7,null,7,null,7,null,7,null,7,null,7]
[null,null,null,null,6,null,6,null,6,null,6,null,6,null,6]
[null,null,null,null,5,null,5,null,5,null,5,null,5,null,5]
[null,null,null,null,4,null,4,null,4,null,4,null,4,null,4]
[null,null,null,null,3,null,3,null,3,null,3,null,3,null,3]
[null,null,null,null,2,null,2,null,2,null,2,null,2,null,2]
[null,null,null,null,1,null,1,null,1,null,1,null,1,null,1]